Ticket #351 (closed Comment: invalid)

Opened 4 years ago

Last modified 4 years ago

Build error - CVTimeStamp

Reported by: mscifo Owned by:
Priority: normal Milestone:
Component: Other Version: 1.0b7
Keywords: Cc:

Description

I checked out the latest from trunk and am trying to successfully build the project.

I'm building on OSX 10.5.8 using Xcode 3.1.4 with 10.4 | Release | Complete Sapphire.

I've copied the BackRow? 3.0 SDK files to my system and manually add the CoreVideo? framework to the project. I'm getting build errors related to CVTimeStamp and some other stuff. Can anyone please help?

Building target “SapphireLeopardCompatClasses” of project “SapphireCompatibilityClasses” with configuration “Release” — (1 error)
	    cd /Users/mscifo/Development/sapphire/SapphireCompatibilityClasses
    setenv MACOSX_DEPLOYMENT_TARGET 10.4
    /Developer/usr/bin/gcc-4.0 -arch ppc7400 -dynamiclib -isysroot /Developer/SDKs/MacOSX10.4u.sdk -L/Users/mscifo/Development/sapphire/SapphireCompatibilityClasses/../build/Release -F/Users/mscifo/Development/sapphire/SapphireCompatibilityClasses/../build/Release -F/Developer/SDKs/MacOSX10.4u.sdk/System/Library/PrivateFrameworks -F/Developer/SDKs/MacOSX10.4u.sdk/System/Library/PrivateFrameworks -filelist /Users/mscifo/Development/sapphire/SapphireCompatibilityClasses/../build/SapphireCompatibilityClasses.build/Release/SapphireLeopardCompatClasses.build/Objects-normal/ppc7400/SapphireLeopardCompatClasses.LinkFileList -install_name /Users/mscifo/Library/Frameworks/SapphireLeopardCompatClasses.framework/Versions/A/SapphireLeopardCompatClasses -mmacosx-version-min=10.4 -framework Foundation -framework AppKit -framework BackRow -framework AppKit -framework Foundation -Wl,-single_module -compatibility_version 1 -current_version 1 -o /Users/mscifo/Development/sapphire/SapphireCompatibilityClasses/../build/SapphireCompatibilityClasses.build/Release/SapphireLeopardCompatClasses.build/Objects-normal/ppc7400/SapphireLeopardCompatClasses
ld warning: in /Developer/SDKs/MacOSX10.4u.sdk/System/Library/PrivateFrameworks/BackRow.framework/BackRow, file is not of required architecture
Undefined symbols:
  ".objc_class_name_BRController", referenced from:
      .objc_class_name_BRLayerController in BRLayerController.o
ld: symbol(s) not found
collect2: ld returned 1 exit status
		  ".objc_class_name_BRController", referenced from:
		      .objc_class_name_BRLayerController in BRLayerController.o
		ld: symbol(s) not found
		collect2: ld returned 1 exit status
Building target “SapphireCompatClasses” of project “SapphireCompatibilityClasses” with configuration “Release” — (6 errors, 2 warnings)
	    cd /Users/mscifo/Development/sapphire/SapphireCompatibilityClasses
    /Developer/usr/bin/gcc-4.0 -x objective-c-header -arch i386 -fmessage-length=0 -pipe -Wno-trigraphs -fpascal-strings -fasm-blocks -Os -Wreturn-type -Wunused-variable -isysroot /Developer/SDKs/MacOSX10.4u.sdk -mmacosx-version-min=10.4 -gdwarf-2 -I/Users/mscifo/Development/sapphire/SapphireCompatibilityClasses/../build/SapphireCompatibilityClasses.build/Release/SapphireCompatClasses.build/SapphireCompatClasses.hmap -F/Users/mscifo/Development/sapphire/SapphireCompatibilityClasses/../build/Release -F/Developer/SDKs/MacOSX10.4u.sdk/System/Library/PrivateFrameworks -F/Developer/SDKs/MacOSX10.4u.sdk/System/Library/PrivateFrameworks -I/Users/mscifo/Development/sapphire/SapphireCompatibilityClasses/../build/Release/include -I/Users/mscifo/Development/sapphire/SapphireCompatibilityClasses/../build/SapphireCompatibilityClasses.build/Release/SapphireCompatClasses.build/DerivedSources/i386 -I/Users/mscifo/Development/sapphire/SapphireCompatibilityClasses/../build/SapphireCompatibilityClasses.build/Release/SapphireCompatClasses.build/DerivedSources -c /Users/mscifo/Development/sapphire/SapphireCompatibilityClasses/Sapphire_Prefix.pch -o /var/folders/VY/VYbADtKZGRa4OHBFErjaDU+++TI/-Caches-/com.apple.Xcode.501/SharedPrecompiledHeaders/Sapphire_Prefix-ccniqxuydzpkhecsesgenhlblifq/Sapphire_Prefix.pch.gch
In file included from /Developer/SDKs/MacOSX10.4u.sdk/System/Library/PrivateFrameworks/BackRow.framework/PrivateHeaders/BRRenderLayer.h:9,
                 from /Developer/SDKs/MacOSX10.4u.sdk/System/Library/PrivateFrameworks/BackRow.framework/PrivateHeaders/BRAdornedMenuItemLayer.h:7,
                 from /Developer/SDKs/MacOSX10.4u.sdk/System/Library/PrivateFrameworks/BackRow.framework/PrivateHeaders/BRAdornedMenuItemLayer-TextureCreation.h:7,
                 from /Developer/SDKs/MacOSX10.4u.sdk/System/Library/PrivateFrameworks/BackRow.framework/PrivateHeaders/BackRow.h:17,
                 from /Users/mscifo/Development/sapphire/SapphireCompatibilityClasses/Sapphire_Prefix.pch:7:
/Developer/SDKs/MacOSX10.4u.sdk/System/Library/PrivateFrameworks/BackRow.framework/PrivateHeaders/BRDisplayLinkItemProtocol.h:8: error: syntax error before 'CVTimeStamp'
/Developer/SDKs/MacOSX10.4u.sdk/System/Library/PrivateFrameworks/BackRow.framework/PrivateHeaders/BRDisplayLinkItemProtocol.h:9: warning: '@end' must appear in an @implementation context
In file included from /Developer/SDKs/MacOSX10.4u.sdk/System/Library/PrivateFrameworks/BackRow.framework/PrivateHeaders/BRAdornedMenuItemLayer.h:7,
                 from /Developer/SDKs/MacOSX10.4u.sdk/System/Library/PrivateFrameworks/BackRow.framework/PrivateHeaders/BRAdornedMenuItemLayer-TextureCreation.h:7,
                 from /Developer/SDKs/MacOSX10.4u.sdk/System/Library/PrivateFrameworks/BackRow.framework/PrivateHeaders/BackRow.h:17,
                 from /Users/mscifo/Development/sapphire/SapphireCompatibilityClasses/Sapphire_Prefix.pch:7:
/Developer/SDKs/MacOSX10.4u.sdk/System/Library/PrivateFrameworks/BackRow.framework/PrivateHeaders/BRRenderLayer.h:57: error: syntax error before 'CVTimeStamp'
/Developer/SDKs/MacOSX10.4u.sdk/System/Library/PrivateFrameworks/BackRow.framework/PrivateHeaders/BRRenderLayer.h:58: fatal error: method definition not in @implementation context
compilation terminated.
		                 from /Users/mscifo/Development/sapphire/SapphireCompatibilityClasses/Sapphire_Prefix.pch:7:
			                 from /Developer/SDKs/MacOSX10.4u.sdk/System/Library/PrivateFrameworks/BackRow.framework/PrivateHeaders/BackRow.h:17,
				                 from /Developer/SDKs/MacOSX10.4u.sdk/System/Library/PrivateFrameworks/BackRow.framework/PrivateHeaders/BRAdornedMenuItemLayer-TextureCreation.h:7,
					                 from /Developer/SDKs/MacOSX10.4u.sdk/System/Library/PrivateFrameworks/BackRow.framework/PrivateHeaders/BRAdornedMenuItemLayer.h:7,
						In file included from /Developer/SDKs/MacOSX10.4u.sdk/System/Library/PrivateFrameworks/BackRow.framework/PrivateHeaders/BRRenderLayer.h:9,
							/Developer/SDKs/MacOSX10.4u.sdk/System/Library/PrivateFrameworks/BackRow.framework/PrivateHeaders/BRDisplayLinkItemProtocol.h:8: error: syntax error before 'CVTimeStamp'
							/Developer/SDKs/MacOSX10.4u.sdk/System/Library/PrivateFrameworks/BackRow.framework/PrivateHeaders/BRDisplayLinkItemProtocol.h:9: warning: '@end' must appear in an @implementation context
		                 from /Users/mscifo/Development/sapphire/SapphireCompatibilityClasses/Sapphire_Prefix.pch:7:
			                 from /Developer/SDKs/MacOSX10.4u.sdk/System/Library/PrivateFrameworks/BackRow.framework/PrivateHeaders/BackRow.h:17,
				                 from /Developer/SDKs/MacOSX10.4u.sdk/System/Library/PrivateFrameworks/BackRow.framework/PrivateHeaders/BRAdornedMenuItemLayer-TextureCreation.h:7,
					In file included from /Developer/SDKs/MacOSX10.4u.sdk/System/Library/PrivateFrameworks/BackRow.framework/PrivateHeaders/BRAdornedMenuItemLayer.h:7,
						/Developer/SDKs/MacOSX10.4u.sdk/System/Library/PrivateFrameworks/BackRow.framework/PrivateHeaders/BRRenderLayer.h:57: error: syntax error before 'CVTimeStamp'
						/Developer/SDKs/MacOSX10.4u.sdk/System/Library/PrivateFrameworks/BackRow.framework/PrivateHeaders/BRRenderLayer.h:58: fatal error: method definition not in @implementation context
	    cd /Users/mscifo/Development/sapphire/SapphireCompatibilityClasses
    /Developer/usr/bin/gcc-4.0 -x objective-c-header -arch ppc -mcpu=G4 -fmessage-length=0 -pipe -Wno-trigraphs -fpascal-strings -Os -Wreturn-type -Wunused-variable -isysroot /Developer/SDKs/MacOSX10.4u.sdk -mtune=G5 -mmacosx-version-min=10.4 -gdwarf-2 -I/Users/mscifo/Development/sapphire/SapphireCompatibilityClasses/../build/SapphireCompatibilityClasses.build/Release/SapphireCompatClasses.build/SapphireCompatClasses.hmap -F/Users/mscifo/Development/sapphire/SapphireCompatibilityClasses/../build/Release -F/Developer/SDKs/MacOSX10.4u.sdk/System/Library/PrivateFrameworks -F/Developer/SDKs/MacOSX10.4u.sdk/System/Library/PrivateFrameworks -I/Users/mscifo/Development/sapphire/SapphireCompatibilityClasses/../build/Release/include -I/Users/mscifo/Development/sapphire/SapphireCompatibilityClasses/../build/SapphireCompatibilityClasses.build/Release/SapphireCompatClasses.build/DerivedSources/ppc7400 -I/Users/mscifo/Development/sapphire/SapphireCompatibilityClasses/../build/SapphireCompatibilityClasses.build/Release/SapphireCompatClasses.build/DerivedSources -c /Users/mscifo/Development/sapphire/SapphireCompatibilityClasses/Sapphire_Prefix.pch -o /var/folders/VY/VYbADtKZGRa4OHBFErjaDU+++TI/-Caches-/com.apple.Xcode.501/SharedPrecompiledHeaders/Sapphire_Prefix-cynxthbkwvkbmngkiducbghjltao/Sapphire_Prefix.pch.gch
In file included from /Developer/SDKs/MacOSX10.4u.sdk/System/Library/PrivateFrameworks/BackRow.framework/PrivateHeaders/BRRenderLayer.h:9,
                 from /Developer/SDKs/MacOSX10.4u.sdk/System/Library/PrivateFrameworks/BackRow.framework/PrivateHeaders/BRAdornedMenuItemLayer.h:7,
                 from /Developer/SDKs/MacOSX10.4u.sdk/System/Library/PrivateFrameworks/BackRow.framework/PrivateHeaders/BRAdornedMenuItemLayer-TextureCreation.h:7,
                 from /Developer/SDKs/MacOSX10.4u.sdk/System/Library/PrivateFrameworks/BackRow.framework/PrivateHeaders/BackRow.h:17,
                 from /Users/mscifo/Development/sapphire/SapphireCompatibilityClasses/Sapphire_Prefix.pch:7:
/Developer/SDKs/MacOSX10.4u.sdk/System/Library/PrivateFrameworks/BackRow.framework/PrivateHeaders/BRDisplayLinkItemProtocol.h:8: error: syntax error before 'CVTimeStamp'
/Developer/SDKs/MacOSX10.4u.sdk/System/Library/PrivateFrameworks/BackRow.framework/PrivateHeaders/BRDisplayLinkItemProtocol.h:9: warning: '@end' must appear in an @implementation context
In file included from /Developer/SDKs/MacOSX10.4u.sdk/System/Library/PrivateFrameworks/BackRow.framework/PrivateHeaders/BRAdornedMenuItemLayer.h:7,
                 from /Developer/SDKs/MacOSX10.4u.sdk/System/Library/PrivateFrameworks/BackRow.framework/PrivateHeaders/BRAdornedMenuItemLayer-TextureCreation.h:7,
                 from /Developer/SDKs/MacOSX10.4u.sdk/System/Library/PrivateFrameworks/BackRow.framework/PrivateHeaders/BackRow.h:17,
                 from /Users/mscifo/Development/sapphire/SapphireCompatibilityClasses/Sapphire_Prefix.pch:7:
/Developer/SDKs/MacOSX10.4u.sdk/System/Library/PrivateFrameworks/BackRow.framework/PrivateHeaders/BRRenderLayer.h:57: error: syntax error before 'CVTimeStamp'
/Developer/SDKs/MacOSX10.4u.sdk/System/Library/PrivateFrameworks/BackRow.framework/PrivateHeaders/BRRenderLayer.h:58: fatal error: method definition not in @implementation context
compilation terminated.
		                 from /Users/mscifo/Development/sapphire/SapphireCompatibilityClasses/Sapphire_Prefix.pch:7:
			                 from /Developer/SDKs/MacOSX10.4u.sdk/System/Library/PrivateFrameworks/BackRow.framework/PrivateHeaders/BackRow.h:17,
				                 from /Developer/SDKs/MacOSX10.4u.sdk/System/Library/PrivateFrameworks/BackRow.framework/PrivateHeaders/BRAdornedMenuItemLayer-TextureCreation.h:7,
					                 from /Developer/SDKs/MacOSX10.4u.sdk/System/Library/PrivateFrameworks/BackRow.framework/PrivateHeaders/BRAdornedMenuItemLayer.h:7,
						In file included from /Developer/SDKs/MacOSX10.4u.sdk/System/Library/PrivateFrameworks/BackRow.framework/PrivateHeaders/BRRenderLayer.h:9,
							/Developer/SDKs/MacOSX10.4u.sdk/System/Library/PrivateFrameworks/BackRow.framework/PrivateHeaders/BRDisplayLinkItemProtocol.h:8: error: syntax error before 'CVTimeStamp'
							/Developer/SDKs/MacOSX10.4u.sdk/System/Library/PrivateFrameworks/BackRow.framework/PrivateHeaders/BRDisplayLinkItemProtocol.h:9: warning: '@end' must appear in an @implementation context
		                 from /Users/mscifo/Development/sapphire/SapphireCompatibilityClasses/Sapphire_Prefix.pch:7:
			                 from /Developer/SDKs/MacOSX10.4u.sdk/System/Library/PrivateFrameworks/BackRow.framework/PrivateHeaders/BackRow.h:17,
				                 from /Developer/SDKs/MacOSX10.4u.sdk/System/Library/PrivateFrameworks/BackRow.framework/PrivateHeaders/BRAdornedMenuItemLayer-TextureCreation.h:7,
					In file included from /Developer/SDKs/MacOSX10.4u.sdk/System/Library/PrivateFrameworks/BackRow.framework/PrivateHeaders/BRAdornedMenuItemLayer.h:7,
						/Developer/SDKs/MacOSX10.4u.sdk/System/Library/PrivateFrameworks/BackRow.framework/PrivateHeaders/BRRenderLayer.h:57: error: syntax error before 'CVTimeStamp'
						/Developer/SDKs/MacOSX10.4u.sdk/System/Library/PrivateFrameworks/BackRow.framework/PrivateHeaders/BRRenderLayer.h:58: fatal error: method definition not in @implementation context
Building target “SapphireTakeThreeCompatClasses” of project “SapphireCompatibilityClasses” with configuration “Release” — (1 error)
	    cd /Users/mscifo/Development/sapphire/SapphireCompatibilityClasses
    setenv MACOSX_DEPLOYMENT_TARGET 10.4
    /Developer/usr/bin/gcc-4.0 -arch ppc7400 -dynamiclib -isysroot /Developer/SDKs/MacOSX10.4u.sdk -L/Users/mscifo/Development/sapphire/SapphireCompatibilityClasses/../build/Release -F/Users/mscifo/Development/sapphire/SapphireCompatibilityClasses/../build/Release -F/Developer/SDKs/MacOSX10.4u.sdk/System/Library/PrivateFrameworks -F/Developer/SDKs/MacOSX10.4u.sdk/System/Library/PrivateFrameworks -F/Developer/SDKs/MacOSX10.4u.sdk/System/Library/PrivateFrameworks -filelist /Users/mscifo/Development/sapphire/SapphireCompatibilityClasses/../build/SapphireCompatibilityClasses.build/Release/SapphireTakeThreeCompatClasses.build/Objects-normal/ppc7400/SapphireTakeThreeCompatClasses.LinkFileList -install_name /Users/mscifo/Library/Frameworks/SapphireTakeThreeCompatClasses.framework/Versions/A/SapphireTakeThreeCompatClasses -mmacosx-version-min=10.4 -framework Foundation -framework AppKit -framework AppKit -framework Foundation -framework BackRow -Wl,-single_module -compatibility_version 1 -current_version 1 -o /Users/mscifo/Development/sapphire/SapphireCompatibilityClasses/../build/SapphireCompatibilityClasses.build/Release/SapphireTakeThreeCompatClasses.build/Objects-normal/ppc7400/SapphireTakeThreeCompatClasses
ld warning: in /Developer/SDKs/MacOSX10.4u.sdk/System/Library/PrivateFrameworks/BackRow.framework/BackRow, file is not of required architecture
Undefined symbols:
  ".objc_class_name_BRMenuController", referenced from:
      .objc_class_name_BRCenteredMenuController in BRCenteredMenuController.o
ld: symbol(s) not found
collect2: ld returned 1 exit status
		  ".objc_class_name_BRMenuController", referenced from:
		      .objc_class_name_BRCenteredMenuController in BRCenteredMenuController.o
		ld: symbol(s) not found
		collect2: ld returned 1 exit status
Building target “Sapphire” of project “Sapphire” with configuration “Release” — (6 errors, 2 warnings)
	    cd /Users/mscifo/Development/sapphire/SapphireFrappliance
    /Developer/usr/bin/gcc-4.0 -x objective-c-header -arch i386 -fmessage-length=0 -pipe -Wno-trigraphs -fpascal-strings -fasm-blocks -O3 -Wreturn-type -Wunused-variable -isysroot /Developer/SDKs/MacOSX10.4u.sdk -mmacosx-version-min=10.4 -gdwarf-2 -I/Users/mscifo/Development/sapphire/SapphireFrappliance/../build/Sapphire.build/Release/Sapphire.build/Sapphire.hmap -F/Users/mscifo/Development/sapphire/SapphireFrappliance/../build/Release -F/Developer/SDKs/MacOSX10.4u.sdk/System/Library/PrivateFrameworks -F/Developer/SDKs/MacOSX10.4u.sdk/System/Library/PrivateFrameworks -I/Users/mscifo/Development/sapphire/SapphireFrappliance/../build/Release/include -I/Users/mscifo/Development/sapphire/SapphireFrappliance/../build/Sapphire.build/Release/Sapphire.build/DerivedSources/i386 -I/Users/mscifo/Development/sapphire/SapphireFrappliance/../build/Sapphire.build/Release/Sapphire.build/DerivedSources -c /Users/mscifo/Development/sapphire/SapphireFrappliance/FRAppliance/Sapphire_Prefix.pch -o /var/folders/VY/VYbADtKZGRa4OHBFErjaDU+++TI/-Caches-/com.apple.Xcode.501/SharedPrecompiledHeaders/Sapphire_Prefix-bscdmphjxtuegeatjkbrhiwtgpcz/Sapphire_Prefix.pch.gch
In file included from /Developer/SDKs/MacOSX10.4u.sdk/System/Library/PrivateFrameworks/BackRow.framework/PrivateHeaders/BRRenderLayer.h:9,
                 from /Developer/SDKs/MacOSX10.4u.sdk/System/Library/PrivateFrameworks/BackRow.framework/PrivateHeaders/BRAdornedMenuItemLayer.h:7,
                 from /Developer/SDKs/MacOSX10.4u.sdk/System/Library/PrivateFrameworks/BackRow.framework/PrivateHeaders/BRAdornedMenuItemLayer-TextureCreation.h:7,
                 from /Developer/SDKs/MacOSX10.4u.sdk/System/Library/PrivateFrameworks/BackRow.framework/PrivateHeaders/BackRow.h:17,
                 from /Users/mscifo/Development/sapphire/SapphireFrappliance/FRAppliance/../../SapphireCompatibilityClasses/Sapphire_Prefix.pch:7,
                 from /Users/mscifo/Development/sapphire/SapphireFrappliance/FRAppliance/Sapphire_Prefix.pch:5:
/Developer/SDKs/MacOSX10.4u.sdk/System/Library/PrivateFrameworks/BackRow.framework/PrivateHeaders/BRDisplayLinkItemProtocol.h:8: error: syntax error before 'CVTimeStamp'
/Developer/SDKs/MacOSX10.4u.sdk/System/Library/PrivateFrameworks/BackRow.framework/PrivateHeaders/BRDisplayLinkItemProtocol.h:9: warning: '@end' must appear in an @implementation context
In file included from /Developer/SDKs/MacOSX10.4u.sdk/System/Library/PrivateFrameworks/BackRow.framework/PrivateHeaders/BRAdornedMenuItemLayer.h:7,
                 from /Developer/SDKs/MacOSX10.4u.sdk/System/Library/PrivateFrameworks/BackRow.framework/PrivateHeaders/BRAdornedMenuItemLayer-TextureCreation.h:7,
                 from /Developer/SDKs/MacOSX10.4u.sdk/System/Library/PrivateFrameworks/BackRow.framework/PrivateHeaders/BackRow.h:17,
                 from /Users/mscifo/Development/sapphire/SapphireFrappliance/FRAppliance/../../SapphireCompatibilityClasses/Sapphire_Prefix.pch:7,
                 from /Users/mscifo/Development/sapphire/SapphireFrappliance/FRAppliance/Sapphire_Prefix.pch:5:
/Developer/SDKs/MacOSX10.4u.sdk/System/Library/PrivateFrameworks/BackRow.framework/PrivateHeaders/BRRenderLayer.h:57: error: syntax error before 'CVTimeStamp'
/Developer/SDKs/MacOSX10.4u.sdk/System/Library/PrivateFrameworks/BackRow.framework/PrivateHeaders/BRRenderLayer.h:58: fatal error: method definition not in @implementation context
compilation terminated.
		                 from /Users/mscifo/Development/sapphire/SapphireFrappliance/FRAppliance/Sapphire_Prefix.pch:5:
			                 from /Users/mscifo/Development/sapphire/SapphireFrappliance/FRAppliance/../../SapphireCompatibilityClasses/Sapphire_Prefix.pch:7,
				                 from /Developer/SDKs/MacOSX10.4u.sdk/System/Library/PrivateFrameworks/BackRow.framework/PrivateHeaders/BackRow.h:17,
					                 from /Developer/SDKs/MacOSX10.4u.sdk/System/Library/PrivateFrameworks/BackRow.framework/PrivateHeaders/BRAdornedMenuItemLayer-TextureCreation.h:7,
						                 from /Developer/SDKs/MacOSX10.4u.sdk/System/Library/PrivateFrameworks/BackRow.framework/PrivateHeaders/BRAdornedMenuItemLayer.h:7,
							In file included from /Developer/SDKs/MacOSX10.4u.sdk/System/Library/PrivateFrameworks/BackRow.framework/PrivateHeaders/BRRenderLayer.h:9,
								/Developer/SDKs/MacOSX10.4u.sdk/System/Library/PrivateFrameworks/BackRow.framework/PrivateHeaders/BRDisplayLinkItemProtocol.h:8: error: syntax error before 'CVTimeStamp'
								/Developer/SDKs/MacOSX10.4u.sdk/System/Library/PrivateFrameworks/BackRow.framework/PrivateHeaders/BRDisplayLinkItemProtocol.h:9: warning: '@end' must appear in an @implementation context
		                 from /Users/mscifo/Development/sapphire/SapphireFrappliance/FRAppliance/Sapphire_Prefix.pch:5:
			                 from /Users/mscifo/Development/sapphire/SapphireFrappliance/FRAppliance/../../SapphireCompatibilityClasses/Sapphire_Prefix.pch:7,
				                 from /Developer/SDKs/MacOSX10.4u.sdk/System/Library/PrivateFrameworks/BackRow.framework/PrivateHeaders/BackRow.h:17,
					                 from /Developer/SDKs/MacOSX10.4u.sdk/System/Library/PrivateFrameworks/BackRow.framework/PrivateHeaders/BRAdornedMenuItemLayer-TextureCreation.h:7,
						In file included from /Developer/SDKs/MacOSX10.4u.sdk/System/Library/PrivateFrameworks/BackRow.framework/PrivateHeaders/BRAdornedMenuItemLayer.h:7,
							/Developer/SDKs/MacOSX10.4u.sdk/System/Library/PrivateFrameworks/BackRow.framework/PrivateHeaders/BRRenderLayer.h:57: error: syntax error before 'CVTimeStamp'
							/Developer/SDKs/MacOSX10.4u.sdk/System/Library/PrivateFrameworks/BackRow.framework/PrivateHeaders/BRRenderLayer.h:58: fatal error: method definition not in @implementation context
	    cd /Users/mscifo/Development/sapphire/SapphireFrappliance
    /Developer/usr/bin/gcc-4.0 -x objective-c-header -arch ppc -mcpu=G4 -fmessage-length=0 -pipe -Wno-trigraphs -fpascal-strings -O3 -Wreturn-type -Wunused-variable -isysroot /Developer/SDKs/MacOSX10.4u.sdk -mtune=G5 -mmacosx-version-min=10.4 -gdwarf-2 -I/Users/mscifo/Development/sapphire/SapphireFrappliance/../build/Sapphire.build/Release/Sapphire.build/Sapphire.hmap -F/Users/mscifo/Development/sapphire/SapphireFrappliance/../build/Release -F/Developer/SDKs/MacOSX10.4u.sdk/System/Library/PrivateFrameworks -F/Developer/SDKs/MacOSX10.4u.sdk/System/Library/PrivateFrameworks -I/Users/mscifo/Development/sapphire/SapphireFrappliance/../build/Release/include -I/Users/mscifo/Development/sapphire/SapphireFrappliance/../build/Sapphire.build/Release/Sapphire.build/DerivedSources/ppc7400 -I/Users/mscifo/Development/sapphire/SapphireFrappliance/../build/Sapphire.build/Release/Sapphire.build/DerivedSources -c /Users/mscifo/Development/sapphire/SapphireFrappliance/FRAppliance/Sapphire_Prefix.pch -o /var/folders/VY/VYbADtKZGRa4OHBFErjaDU+++TI/-Caches-/com.apple.Xcode.501/SharedPrecompiledHeaders/Sapphire_Prefix-fvtlttpkmipsawckxrhagwoizroi/Sapphire_Prefix.pch.gch
In file included from /Developer/SDKs/MacOSX10.4u.sdk/System/Library/PrivateFrameworks/BackRow.framework/PrivateHeaders/BRRenderLayer.h:9,
                 from /Developer/SDKs/MacOSX10.4u.sdk/System/Library/PrivateFrameworks/BackRow.framework/PrivateHeaders/BRAdornedMenuItemLayer.h:7,
                 from /Developer/SDKs/MacOSX10.4u.sdk/System/Library/PrivateFrameworks/BackRow.framework/PrivateHeaders/BRAdornedMenuItemLayer-TextureCreation.h:7,
                 from /Developer/SDKs/MacOSX10.4u.sdk/System/Library/PrivateFrameworks/BackRow.framework/PrivateHeaders/BackRow.h:17,
                 from /Users/mscifo/Development/sapphire/SapphireFrappliance/FRAppliance/../../SapphireCompatibilityClasses/Sapphire_Prefix.pch:7,
                 from /Users/mscifo/Development/sapphire/SapphireFrappliance/FRAppliance/Sapphire_Prefix.pch:5:
/Developer/SDKs/MacOSX10.4u.sdk/System/Library/PrivateFrameworks/BackRow.framework/PrivateHeaders/BRDisplayLinkItemProtocol.h:8: error: syntax error before 'CVTimeStamp'
/Developer/SDKs/MacOSX10.4u.sdk/System/Library/PrivateFrameworks/BackRow.framework/PrivateHeaders/BRDisplayLinkItemProtocol.h:9: warning: '@end' must appear in an @implementation context
In file included from /Developer/SDKs/MacOSX10.4u.sdk/System/Library/PrivateFrameworks/BackRow.framework/PrivateHeaders/BRAdornedMenuItemLayer.h:7,
                 from /Developer/SDKs/MacOSX10.4u.sdk/System/Library/PrivateFrameworks/BackRow.framework/PrivateHeaders/BRAdornedMenuItemLayer-TextureCreation.h:7,
                 from /Developer/SDKs/MacOSX10.4u.sdk/System/Library/PrivateFrameworks/BackRow.framework/PrivateHeaders/BackRow.h:17,
                 from /Users/mscifo/Development/sapphire/SapphireFrappliance/FRAppliance/../../SapphireCompatibilityClasses/Sapphire_Prefix.pch:7,
                 from /Users/mscifo/Development/sapphire/SapphireFrappliance/FRAppliance/Sapphire_Prefix.pch:5:
/Developer/SDKs/MacOSX10.4u.sdk/System/Library/PrivateFrameworks/BackRow.framework/PrivateHeaders/BRRenderLayer.h:57: error: syntax error before 'CVTimeStamp'
/Developer/SDKs/MacOSX10.4u.sdk/System/Library/PrivateFrameworks/BackRow.framework/PrivateHeaders/BRRenderLayer.h:58: fatal error: method definition not in @implementation context
compilation terminated.
		                 from /Users/mscifo/Development/sapphire/SapphireFrappliance/FRAppliance/Sapphire_Prefix.pch:5:
			                 from /Users/mscifo/Development/sapphire/SapphireFrappliance/FRAppliance/../../SapphireCompatibilityClasses/Sapphire_Prefix.pch:7,
				                 from /Developer/SDKs/MacOSX10.4u.sdk/System/Library/PrivateFrameworks/BackRow.framework/PrivateHeaders/BackRow.h:17,
					                 from /Developer/SDKs/MacOSX10.4u.sdk/System/Library/PrivateFrameworks/BackRow.framework/PrivateHeaders/BRAdornedMenuItemLayer-TextureCreation.h:7,
						                 from /Developer/SDKs/MacOSX10.4u.sdk/System/Library/PrivateFrameworks/BackRow.framework/PrivateHeaders/BRAdornedMenuItemLayer.h:7,
							In file included from /Developer/SDKs/MacOSX10.4u.sdk/System/Library/PrivateFrameworks/BackRow.framework/PrivateHeaders/BRRenderLayer.h:9,
								/Developer/SDKs/MacOSX10.4u.sdk/System/Library/PrivateFrameworks/BackRow.framework/PrivateHeaders/BRDisplayLinkItemProtocol.h:8: error: syntax error before 'CVTimeStamp'
								/Developer/SDKs/MacOSX10.4u.sdk/System/Library/PrivateFrameworks/BackRow.framework/PrivateHeaders/BRDisplayLinkItemProtocol.h:9: warning: '@end' must appear in an @implementation context
		                 from /Users/mscifo/Development/sapphire/SapphireFrappliance/FRAppliance/Sapphire_Prefix.pch:5:
			                 from /Users/mscifo/Development/sapphire/SapphireFrappliance/FRAppliance/../../SapphireCompatibilityClasses/Sapphire_Prefix.pch:7,
				                 from /Developer/SDKs/MacOSX10.4u.sdk/System/Library/PrivateFrameworks/BackRow.framework/PrivateHeaders/BackRow.h:17,
					                 from /Developer/SDKs/MacOSX10.4u.sdk/System/Library/PrivateFrameworks/BackRow.framework/PrivateHeaders/BRAdornedMenuItemLayer-TextureCreation.h:7,
						In file included from /Developer/SDKs/MacOSX10.4u.sdk/System/Library/PrivateFrameworks/BackRow.framework/PrivateHeaders/BRAdornedMenuItemLayer.h:7,
							/Developer/SDKs/MacOSX10.4u.sdk/System/Library/PrivateFrameworks/BackRow.framework/PrivateHeaders/BRRenderLayer.h:57: error: syntax error before 'CVTimeStamp'
							/Developer/SDKs/MacOSX10.4u.sdk/System/Library/PrivateFrameworks/BackRow.framework/PrivateHeaders/BRRenderLayer.h:58: fatal error: method definition not in @implementation context
Building target “LeopardOnly” of project “Sapphire” with configuration “Release” — (26 errors)
	    cd /Users/mscifo/Development/sapphire/SapphireFrappliance
    /Developer/usr/bin/gcc-4.0 -x objective-c -arch i386 -fmessage-length=0 -pipe -Wno-trigraphs -fpascal-strings -fasm-blocks -O3 -Wreturn-type -Wunused-variable -isysroot /Developer/SDKs/MacOSX10.4u.sdk -mmacosx-version-min=10.4 -gdwarf-2 -I/Users/mscifo/Development/sapphire/SapphireFrappliance/../build/Sapphire.build/Release/LeopardOnly.build/LeopardOnly.hmap -F/Users/mscifo/Development/sapphire/SapphireFrappliance/../build/Release -F/Developer/SDKs/MacOSX10.4u.sdk/System/Library/PrivateFrameworks -F/Developer/SDKs/MacOSX10.4u.sdk/System/Library/PrivateFrameworks -I/Users/mscifo/Development/sapphire/SapphireFrappliance/../build/Release/include -I/Users/mscifo/Development/sapphire/SapphireFrappliance/../build/Sapphire.build/Release/LeopardOnly.build/DerivedSources/i386 -I/Users/mscifo/Development/sapphire/SapphireFrappliance/../build/Sapphire.build/Release/LeopardOnly.build/DerivedSources -c /Users/mscifo/Development/sapphire/SapphireFrappliance/Leopard/SapphireLeopardOnly.m -o /Users/mscifo/Development/sapphire/SapphireFrappliance/../build/Sapphire.build/Release/LeopardOnly.build/Objects-normal/i386/SapphireLeopardOnly.o
In file included from /Users/mscifo/Development/sapphire/SapphireFrappliance/Leopard/SapphireLeopardOnly.m:22:
/Users/mscifo/Development/sapphire/SapphireFrappliance/Leopard/SapphireLeopardFileEvents.h:32: error: syntax error before 'FSEventStreamRef'
		In file included from /Users/mscifo/Development/sapphire/SapphireFrappliance/Leopard/SapphireLeopardOnly.m:22:
			/Users/mscifo/Development/sapphire/SapphireFrappliance/Leopard/SapphireLeopardFileEvents.h:32: error: syntax error before 'FSEventStreamRef'
	    cd /Users/mscifo/Development/sapphire/SapphireFrappliance
    /Developer/usr/bin/gcc-4.0 -x objective-c -arch i386 -fmessage-length=0 -pipe -Wno-trigraphs -fpascal-strings -fasm-blocks -O3 -Wreturn-type -Wunused-variable -isysroot /Developer/SDKs/MacOSX10.4u.sdk -mmacosx-version-min=10.4 -gdwarf-2 -I/Users/mscifo/Development/sapphire/SapphireFrappliance/../build/Sapphire.build/Release/LeopardOnly.build/LeopardOnly.hmap -F/Users/mscifo/Development/sapphire/SapphireFrappliance/../build/Release -F/Developer/SDKs/MacOSX10.4u.sdk/System/Library/PrivateFrameworks -F/Developer/SDKs/MacOSX10.4u.sdk/System/Library/PrivateFrameworks -I/Users/mscifo/Development/sapphire/SapphireFrappliance/../build/Release/include -I/Users/mscifo/Development/sapphire/SapphireFrappliance/../build/Sapphire.build/Release/LeopardOnly.build/DerivedSources/i386 -I/Users/mscifo/Development/sapphire/SapphireFrappliance/../build/Sapphire.build/Release/LeopardOnly.build/DerivedSources -c /Users/mscifo/Development/sapphire/SapphireFrappliance/Leopard/SapphireLeopardFileEvents.m -o /Users/mscifo/Development/sapphire/SapphireFrappliance/../build/Sapphire.build/Release/LeopardOnly.build/Objects-normal/i386/SapphireLeopardFileEvents.o
In file included from /Users/mscifo/Development/sapphire/SapphireFrappliance/Leopard/SapphireLeopardFileEvents.m:21:
/Users/mscifo/Development/sapphire/SapphireFrappliance/Leopard/SapphireLeopardFileEvents.h:32: error: syntax error before 'FSEventStreamRef'
/Users/mscifo/Development/sapphire/SapphireFrappliance/Leopard/SapphireLeopardFileEvents.m:31: error: syntax error before 'stream'
/Users/mscifo/Development/sapphire/SapphireFrappliance/Leopard/SapphireLeopardFileEvents.m: In function 'fileStreamCallback':
/Users/mscifo/Development/sapphire/SapphireFrappliance/Leopard/SapphireLeopardFileEvents.m:34: error: 'eventPaths' undeclared (first use in this function)
/Users/mscifo/Development/sapphire/SapphireFrappliance/Leopard/SapphireLeopardFileEvents.m:34: error: (Each undeclared identifier is reported only once
/Users/mscifo/Development/sapphire/SapphireFrappliance/Leopard/SapphireLeopardFileEvents.m:34: error: for each function it appears in.)
/Users/mscifo/Development/sapphire/SapphireFrappliance/Leopard/SapphireLeopardFileEvents.m:35: error: 'numEvents' undeclared (first use in this function)
/Users/mscifo/Development/sapphire/SapphireFrappliance/Leopard/SapphireLeopardFileEvents.m:37: error: 'context' undeclared (first use in this function)
/Users/mscifo/Development/sapphire/SapphireFrappliance/Leopard/SapphireLeopardFileEvents.m: In function '-[SapphireLeopardFileEvents initWithContext:]':
/Users/mscifo/Development/sapphire/SapphireFrappliance/Leopard/SapphireLeopardFileEvents.m:51: error: 'FSEventStreamContext' undeclared (first use in this function)
/Users/mscifo/Development/sapphire/SapphireFrappliance/Leopard/SapphireLeopardFileEvents.m:51: error: syntax error before 'fcontext'
/Users/mscifo/Development/sapphire/SapphireFrappliance/Leopard/SapphireLeopardFileEvents.m:52: error: 'fcontext' undeclared (first use in this function)
/Users/mscifo/Development/sapphire/SapphireFrappliance/Leopard/SapphireLeopardFileEvents.m:57: error: 'stream' undeclared (first use in this function)
/Users/mscifo/Development/sapphire/SapphireFrappliance/Leopard/SapphireLeopardFileEvents.m:57: error: 'kFSEventStreamEventIdSinceNow' undeclared (first use in this function)
/Users/mscifo/Development/sapphire/SapphireFrappliance/Leopard/SapphireLeopardFileEvents.m:57: error: 'kFSEventStreamCreateFlagUseCFTypes' undeclared (first use in this function)
/Users/mscifo/Development/sapphire/SapphireFrappliance/Leopard/SapphireLeopardFileEvents.m: In function '-[SapphireLeopardFileEvents dealloc]':
/Users/mscifo/Development/sapphire/SapphireFrappliance/Leopard/SapphireLeopardFileEvents.m:66: error: 'stream' undeclared (first use in this function)
		In file included from /Users/mscifo/Development/sapphire/SapphireFrappliance/Leopard/SapphireLeopardFileEvents.m:21:
			/Users/mscifo/Development/sapphire/SapphireFrappliance/Leopard/SapphireLeopardFileEvents.h:32: error: syntax error before 'FSEventStreamRef'
		/Users/mscifo/Development/sapphire/SapphireFrappliance/Leopard/SapphireLeopardFileEvents.m:31: error: syntax error before 'stream'
		/Users/mscifo/Development/sapphire/SapphireFrappliance/Leopard/SapphireLeopardFileEvents.m:34: error: 'eventPaths' undeclared (first use in this function)
		/Users/mscifo/Development/sapphire/SapphireFrappliance/Leopard/SapphireLeopardFileEvents.m:35: error: 'numEvents' undeclared (first use in this function)
		/Users/mscifo/Development/sapphire/SapphireFrappliance/Leopard/SapphireLeopardFileEvents.m:37: error: 'context' undeclared (first use in this function)
		/Users/mscifo/Development/sapphire/SapphireFrappliance/Leopard/SapphireLeopardFileEvents.m:51: error: 'FSEventStreamContext' undeclared (first use in this function)
		/Users/mscifo/Development/sapphire/SapphireFrappliance/Leopard/SapphireLeopardFileEvents.m:51: error: syntax error before 'fcontext'
		/Users/mscifo/Development/sapphire/SapphireFrappliance/Leopard/SapphireLeopardFileEvents.m:52: error: 'fcontext' undeclared (first use in this function)
		/Users/mscifo/Development/sapphire/SapphireFrappliance/Leopard/SapphireLeopardFileEvents.m:57: error: 'stream' undeclared (first use in this function)
		/Users/mscifo/Development/sapphire/SapphireFrappliance/Leopard/SapphireLeopardFileEvents.m:57: error: 'kFSEventStreamEventIdSinceNow' undeclared (first use in this function)
		/Users/mscifo/Development/sapphire/SapphireFrappliance/Leopard/SapphireLeopardFileEvents.m:57: error: 'kFSEventStreamCreateFlagUseCFTypes' undeclared (first use in this function)
		/Users/mscifo/Development/sapphire/SapphireFrappliance/Leopard/SapphireLeopardFileEvents.m:66: error: 'stream' undeclared (first use in this function)
	    cd /Users/mscifo/Development/sapphire/SapphireFrappliance
    /Developer/usr/bin/gcc-4.0 -x objective-c -arch ppc -mcpu=G4 -fmessage-length=0 -pipe -Wno-trigraphs -fpascal-strings -O3 -Wreturn-type -Wunused-variable -isysroot /Developer/SDKs/MacOSX10.4u.sdk -mtune=G5 -mmacosx-version-min=10.4 -gdwarf-2 -I/Users/mscifo/Development/sapphire/SapphireFrappliance/../build/Sapphire.build/Release/LeopardOnly.build/LeopardOnly.hmap -F/Users/mscifo/Development/sapphire/SapphireFrappliance/../build/Release -F/Developer/SDKs/MacOSX10.4u.sdk/System/Library/PrivateFrameworks -F/Developer/SDKs/MacOSX10.4u.sdk/System/Library/PrivateFrameworks -I/Users/mscifo/Development/sapphire/SapphireFrappliance/../build/Release/include -I/Users/mscifo/Development/sapphire/SapphireFrappliance/../build/Sapphire.build/Release/LeopardOnly.build/DerivedSources/ppc7400 -I/Users/mscifo/Development/sapphire/SapphireFrappliance/../build/Sapphire.build/Release/LeopardOnly.build/DerivedSources -c /Users/mscifo/Development/sapphire/SapphireFrappliance/Leopard/SapphireLeopardOnly.m -o /Users/mscifo/Development/sapphire/SapphireFrappliance/../build/Sapphire.build/Release/LeopardOnly.build/Objects-normal/ppc7400/SapphireLeopardOnly.o
In file included from /Users/mscifo/Development/sapphire/SapphireFrappliance/Leopard/SapphireLeopardOnly.m:22:
/Users/mscifo/Development/sapphire/SapphireFrappliance/Leopard/SapphireLeopardFileEvents.h:32: error: syntax error before 'FSEventStreamRef'
		In file included from /Users/mscifo/Development/sapphire/SapphireFrappliance/Leopard/SapphireLeopardOnly.m:22:
			/Users/mscifo/Development/sapphire/SapphireFrappliance/Leopard/SapphireLeopardFileEvents.h:32: error: syntax error before 'FSEventStreamRef'
	    cd /Users/mscifo/Development/sapphire/SapphireFrappliance
    /Developer/usr/bin/gcc-4.0 -x objective-c -arch ppc -mcpu=G4 -fmessage-length=0 -pipe -Wno-trigraphs -fpascal-strings -O3 -Wreturn-type -Wunused-variable -isysroot /Developer/SDKs/MacOSX10.4u.sdk -mtune=G5 -mmacosx-version-min=10.4 -gdwarf-2 -I/Users/mscifo/Development/sapphire/SapphireFrappliance/../build/Sapphire.build/Release/LeopardOnly.build/LeopardOnly.hmap -F/Users/mscifo/Development/sapphire/SapphireFrappliance/../build/Release -F/Developer/SDKs/MacOSX10.4u.sdk/System/Library/PrivateFrameworks -F/Developer/SDKs/MacOSX10.4u.sdk/System/Library/PrivateFrameworks -I/Users/mscifo/Development/sapphire/SapphireFrappliance/../build/Release/include -I/Users/mscifo/Development/sapphire/SapphireFrappliance/../build/Sapphire.build/Release/LeopardOnly.build/DerivedSources/ppc7400 -I/Users/mscifo/Development/sapphire/SapphireFrappliance/../build/Sapphire.build/Release/LeopardOnly.build/DerivedSources -c /Users/mscifo/Development/sapphire/SapphireFrappliance/Leopard/SapphireLeopardFileEvents.m -o /Users/mscifo/Development/sapphire/SapphireFrappliance/../build/Sapphire.build/Release/LeopardOnly.build/Objects-normal/ppc7400/SapphireLeopardFileEvents.o
In file included from /Users/mscifo/Development/sapphire/SapphireFrappliance/Leopard/SapphireLeopardFileEvents.m:21:
/Users/mscifo/Development/sapphire/SapphireFrappliance/Leopard/SapphireLeopardFileEvents.h:32: error: syntax error before 'FSEventStreamRef'
/Users/mscifo/Development/sapphire/SapphireFrappliance/Leopard/SapphireLeopardFileEvents.m:31: error: syntax error before 'stream'
/Users/mscifo/Development/sapphire/SapphireFrappliance/Leopard/SapphireLeopardFileEvents.m: In function 'fileStreamCallback':
/Users/mscifo/Development/sapphire/SapphireFrappliance/Leopard/SapphireLeopardFileEvents.m:34: error: 'eventPaths' undeclared (first use in this function)
/Users/mscifo/Development/sapphire/SapphireFrappliance/Leopard/SapphireLeopardFileEvents.m:34: error: (Each undeclared identifier is reported only once
/Users/mscifo/Development/sapphire/SapphireFrappliance/Leopard/SapphireLeopardFileEvents.m:34: error: for each function it appears in.)
/Users/mscifo/Development/sapphire/SapphireFrappliance/Leopard/SapphireLeopardFileEvents.m:35: error: 'numEvents' undeclared (first use in this function)
/Users/mscifo/Development/sapphire/SapphireFrappliance/Leopard/SapphireLeopardFileEvents.m:37: error: 'context' undeclared (first use in this function)
/Users/mscifo/Development/sapphire/SapphireFrappliance/Leopard/SapphireLeopardFileEvents.m: In function '-[SapphireLeopardFileEvents initWithContext:]':
/Users/mscifo/Development/sapphire/SapphireFrappliance/Leopard/SapphireLeopardFileEvents.m:51: error: 'FSEventStreamContext' undeclared (first use in this function)
/Users/mscifo/Development/sapphire/SapphireFrappliance/Leopard/SapphireLeopardFileEvents.m:51: error: syntax error before 'fcontext'
/Users/mscifo/Development/sapphire/SapphireFrappliance/Leopard/SapphireLeopardFileEvents.m:52: error: 'fcontext' undeclared (first use in this function)
/Users/mscifo/Development/sapphire/SapphireFrappliance/Leopard/SapphireLeopardFileEvents.m:57: error: 'stream' undeclared (first use in this function)
/Users/mscifo/Development/sapphire/SapphireFrappliance/Leopard/SapphireLeopardFileEvents.m:57: error: 'kFSEventStreamEventIdSinceNow' undeclared (first use in this function)
/Users/mscifo/Development/sapphire/SapphireFrappliance/Leopard/SapphireLeopardFileEvents.m:57: error: 'kFSEventStreamCreateFlagUseCFTypes' undeclared (first use in this function)
/Users/mscifo/Development/sapphire/SapphireFrappliance/Leopard/SapphireLeopardFileEvents.m: In function '-[SapphireLeopardFileEvents dealloc]':
/Users/mscifo/Development/sapphire/SapphireFrappliance/Leopard/SapphireLeopardFileEvents.m:66: error: 'stream' undeclared (first use in this function)
		In file included from /Users/mscifo/Development/sapphire/SapphireFrappliance/Leopard/SapphireLeopardFileEvents.m:21:
			/Users/mscifo/Development/sapphire/SapphireFrappliance/Leopard/SapphireLeopardFileEvents.h:32: error: syntax error before 'FSEventStreamRef'
		/Users/mscifo/Development/sapphire/SapphireFrappliance/Leopard/SapphireLeopardFileEvents.m:31: error: syntax error before 'stream'
		/Users/mscifo/Development/sapphire/SapphireFrappliance/Leopard/SapphireLeopardFileEvents.m:34: error: 'eventPaths' undeclared (first use in this function)
		/Users/mscifo/Development/sapphire/SapphireFrappliance/Leopard/SapphireLeopardFileEvents.m:35: error: 'numEvents' undeclared (first use in this function)
		/Users/mscifo/Development/sapphire/SapphireFrappliance/Leopard/SapphireLeopardFileEvents.m:37: error: 'context' undeclared (first use in this function)
		/Users/mscifo/Development/sapphire/SapphireFrappliance/Leopard/SapphireLeopardFileEvents.m:51: error: 'FSEventStreamContext' undeclared (first use in this function)
		/Users/mscifo/Development/sapphire/SapphireFrappliance/Leopard/SapphireLeopardFileEvents.m:51: error: syntax error before 'fcontext'
		/Users/mscifo/Development/sapphire/SapphireFrappliance/Leopard/SapphireLeopardFileEvents.m:52: error: 'fcontext' undeclared (first use in this function)
		/Users/mscifo/Development/sapphire/SapphireFrappliance/Leopard/SapphireLeopardFileEvents.m:57: error: 'stream' undeclared (first use in this function)
		/Users/mscifo/Development/sapphire/SapphireFrappliance/Leopard/SapphireLeopardFileEvents.m:57: error: 'kFSEventStreamEventIdSinceNow' undeclared (first use in this function)
		/Users/mscifo/Development/sapphire/SapphireFrappliance/Leopard/SapphireLeopardFileEvents.m:57: error: 'kFSEventStreamCreateFlagUseCFTypes' undeclared (first use in this function)
		/Users/mscifo/Development/sapphire/SapphireFrappliance/Leopard/SapphireLeopardFileEvents.m:66: error: 'stream' undeclared (first use in this function)
Building target “SapphireRescanDir” of project “Sapphire” with configuration “Release” — (6 errors, 2 warnings)
	    cd /Users/mscifo/Development/sapphire/SapphireFrappliance
    /Developer/usr/bin/gcc-4.0 -x objective-c -arch i386 -fmessage-length=0 -pipe -Wno-trigraphs -fpascal-strings -fasm-blocks -O3 -mdynamic-no-pic -Wreturn-type -Wunused-variable -isysroot /Developer/SDKs/MacOSX10.4u.sdk -fvisibility=hidden -mmacosx-version-min=10.4 -gdwarf-2 -iquote /Users/mscifo/Development/sapphire/SapphireFrappliance/../build/Sapphire.build/Release/SapphireRescanDir.build/SapphireRescanDir-generated-files.hmap -I/Users/mscifo/Development/sapphire/SapphireFrappliance/../build/Sapphire.build/Release/SapphireRescanDir.build/SapphireRescanDir-own-target-headers.hmap -I/Users/mscifo/Development/sapphire/SapphireFrappliance/../build/Sapphire.build/Release/SapphireRescanDir.build/SapphireRescanDir-all-target-headers.hmap -iquote /Users/mscifo/Development/sapphire/SapphireFrappliance/../build/Sapphire.build/Release/SapphireRescanDir.build/SapphireRescanDir-project-headers.hmap -F/Users/mscifo/Development/sapphire/SapphireFrappliance/../build/Release -F/Developer/SDKs/MacOSX10.4u.sdk/System/Library/PrivateFrameworks -F/Developer/SDKs/MacOSX10.4u.sdk/System/Library/PrivateFrameworks -I/Users/mscifo/Development/sapphire/SapphireFrappliance/../build/Release/include -I/Users/mscifo/Development/sapphire/SapphireFrappliance/../build/Sapphire.build/Release/SapphireRescanDir.build/DerivedSources/i386 -I/Users/mscifo/Development/sapphire/SapphireFrappliance/../build/Sapphire.build/Release/SapphireRescanDir.build/DerivedSources -c /Users/mscifo/Development/sapphire/SapphireFrappliance/main_rescanDir.m -o /Users/mscifo/Development/sapphire/SapphireFrappliance/../build/Sapphire.build/Release/SapphireRescanDir.build/Objects-normal/i386/main_rescanDir.o
In file included from /Developer/SDKs/MacOSX10.4u.sdk/System/Library/PrivateFrameworks/BackRow.framework/PrivateHeaders/BRRenderLayer.h:9,
                 from /Developer/SDKs/MacOSX10.4u.sdk/System/Library/PrivateFrameworks/BackRow.framework/PrivateHeaders/BRAdornedMenuItemLayer.h:7,
                 from /Developer/SDKs/MacOSX10.4u.sdk/System/Library/PrivateFrameworks/BackRow.framework/PrivateHeaders/BRAdornedMenuItemLayer-TextureCreation.h:7,
                 from /Developer/SDKs/MacOSX10.4u.sdk/System/Library/PrivateFrameworks/BackRow.framework/PrivateHeaders/BackRow.h:17,
                 from /Users/mscifo/Development/sapphire/SapphireFrappliance/../SapphireCompatibilityClasses/Sapphire_Prefix.pch:7,
                 from /Users/mscifo/Development/sapphire/SapphireFrappliance/main_rescanDir.m:21:
/Developer/SDKs/MacOSX10.4u.sdk/System/Library/PrivateFrameworks/BackRow.framework/PrivateHeaders/BRDisplayLinkItemProtocol.h:8: error: syntax error before 'CVTimeStamp'
/Developer/SDKs/MacOSX10.4u.sdk/System/Library/PrivateFrameworks/BackRow.framework/PrivateHeaders/BRDisplayLinkItemProtocol.h:9: warning: '@end' must appear in an @implementation context
In file included from /Developer/SDKs/MacOSX10.4u.sdk/System/Library/PrivateFrameworks/BackRow.framework/PrivateHeaders/BRAdornedMenuItemLayer.h:7,
                 from /Developer/SDKs/MacOSX10.4u.sdk/System/Library/PrivateFrameworks/BackRow.framework/PrivateHeaders/BRAdornedMenuItemLayer-TextureCreation.h:7,
                 from /Developer/SDKs/MacOSX10.4u.sdk/System/Library/PrivateFrameworks/BackRow.framework/PrivateHeaders/BackRow.h:17,
                 from /Users/mscifo/Development/sapphire/SapphireFrappliance/../SapphireCompatibilityClasses/Sapphire_Prefix.pch:7,
                 from /Users/mscifo/Development/sapphire/SapphireFrappliance/main_rescanDir.m:21:
/Developer/SDKs/MacOSX10.4u.sdk/System/Library/PrivateFrameworks/BackRow.framework/PrivateHeaders/BRRenderLayer.h:57: error: syntax error before 'CVTimeStamp'
/Developer/SDKs/MacOSX10.4u.sdk/System/Library/PrivateFrameworks/BackRow.framework/PrivateHeaders/BRRenderLayer.h:58: fatal error: method definition not in @implementation context
compilation terminated.
{standard input}:32:FATAL:.abort  detected.  Assembly stopping.
		                 from /Users/mscifo/Development/sapphire/SapphireFrappliance/main_rescanDir.m:21:
			                 from /Users/mscifo/Development/sapphire/SapphireFrappliance/../SapphireCompatibilityClasses/Sapphire_Prefix.pch:7,
				                 from /Developer/SDKs/MacOSX10.4u.sdk/System/Library/PrivateFrameworks/BackRow.framework/PrivateHeaders/BackRow.h:17,
					                 from /Developer/SDKs/MacOSX10.4u.sdk/System/Library/PrivateFrameworks/BackRow.framework/PrivateHeaders/BRAdornedMenuItemLayer-TextureCreation.h:7,
						                 from /Developer/SDKs/MacOSX10.4u.sdk/System/Library/PrivateFrameworks/BackRow.framework/PrivateHeaders/BRAdornedMenuItemLayer.h:7,
							In file included from /Developer/SDKs/MacOSX10.4u.sdk/System/Library/PrivateFrameworks/BackRow.framework/PrivateHeaders/BRRenderLayer.h:9,
								/Developer/SDKs/MacOSX10.4u.sdk/System/Library/PrivateFrameworks/BackRow.framework/PrivateHeaders/BRDisplayLinkItemProtocol.h:8: error: syntax error before 'CVTimeStamp'
								/Developer/SDKs/MacOSX10.4u.sdk/System/Library/PrivateFrameworks/BackRow.framework/PrivateHeaders/BRDisplayLinkItemProtocol.h:9: warning: '@end' must appear in an @implementation context
		                 from /Users/mscifo/Development/sapphire/SapphireFrappliance/main_rescanDir.m:21:
			                 from /Users/mscifo/Development/sapphire/SapphireFrappliance/../SapphireCompatibilityClasses/Sapphire_Prefix.pch:7,
				                 from /Developer/SDKs/MacOSX10.4u.sdk/System/Library/PrivateFrameworks/BackRow.framework/PrivateHeaders/BackRow.h:17,
					                 from /Developer/SDKs/MacOSX10.4u.sdk/System/Library/PrivateFrameworks/BackRow.framework/PrivateHeaders/BRAdornedMenuItemLayer-TextureCreation.h:7,
						In file included from /Developer/SDKs/MacOSX10.4u.sdk/System/Library/PrivateFrameworks/BackRow.framework/PrivateHeaders/BRAdornedMenuItemLayer.h:7,
							/Developer/SDKs/MacOSX10.4u.sdk/System/Library/PrivateFrameworks/BackRow.framework/PrivateHeaders/BRRenderLayer.h:57: error: syntax error before 'CVTimeStamp'
							/Developer/SDKs/MacOSX10.4u.sdk/System/Library/PrivateFrameworks/BackRow.framework/PrivateHeaders/BRRenderLayer.h:58: fatal error: method definition not in @implementation context
	    cd /Users/mscifo/Development/sapphire/SapphireFrappliance
    /Developer/usr/bin/gcc-4.0 -x objective-c -arch ppc -mcpu=G4 -fmessage-length=0 -pipe -Wno-trigraphs -fpascal-strings -O3 -mdynamic-no-pic -Wreturn-type -Wunused-variable -isysroot /Developer/SDKs/MacOSX10.4u.sdk -mtune=G5 -fvisibility=hidden -mmacosx-version-min=10.4 -gdwarf-2 -iquote /Users/mscifo/Development/sapphire/SapphireFrappliance/../build/Sapphire.build/Release/SapphireRescanDir.build/SapphireRescanDir-generated-files.hmap -I/Users/mscifo/Development/sapphire/SapphireFrappliance/../build/Sapphire.build/Release/SapphireRescanDir.build/SapphireRescanDir-own-target-headers.hmap -I/Users/mscifo/Development/sapphire/SapphireFrappliance/../build/Sapphire.build/Release/SapphireRescanDir.build/SapphireRescanDir-all-target-headers.hmap -iquote /Users/mscifo/Development/sapphire/SapphireFrappliance/../build/Sapphire.build/Release/SapphireRescanDir.build/SapphireRescanDir-project-headers.hmap -F/Users/mscifo/Development/sapphire/SapphireFrappliance/../build/Release -F/Developer/SDKs/MacOSX10.4u.sdk/System/Library/PrivateFrameworks -F/Developer/SDKs/MacOSX10.4u.sdk/System/Library/PrivateFrameworks -I/Users/mscifo/Development/sapphire/SapphireFrappliance/../build/Release/include -I/Users/mscifo/Development/sapphire/SapphireFrappliance/../build/Sapphire.build/Release/SapphireRescanDir.build/DerivedSources/ppc7400 -I/Users/mscifo/Development/sapphire/SapphireFrappliance/../build/Sapphire.build/Release/SapphireRescanDir.build/DerivedSources -c /Users/mscifo/Development/sapphire/SapphireFrappliance/main_rescanDir.m -o /Users/mscifo/Development/sapphire/SapphireFrappliance/../build/Sapphire.build/Release/SapphireRescanDir.build/Objects-normal/ppc7400/main_rescanDir.o
In file included from /Developer/SDKs/MacOSX10.4u.sdk/System/Library/PrivateFrameworks/BackRow.framework/PrivateHeaders/BRRenderLayer.h:9,
                 from /Developer/SDKs/MacOSX10.4u.sdk/System/Library/PrivateFrameworks/BackRow.framework/PrivateHeaders/BRAdornedMenuItemLayer.h:7,
                 from /Developer/SDKs/MacOSX10.4u.sdk/System/Library/PrivateFrameworks/BackRow.framework/PrivateHeaders/BRAdornedMenuItemLayer-TextureCreation.h:7,
                 from /Developer/SDKs/MacOSX10.4u.sdk/System/Library/PrivateFrameworks/BackRow.framework/PrivateHeaders/BackRow.h:17,
                 from /Users/mscifo/Development/sapphire/SapphireFrappliance/../SapphireCompatibilityClasses/Sapphire_Prefix.pch:7,
                 from /Users/mscifo/Development/sapphire/SapphireFrappliance/main_rescanDir.m:21:
/Developer/SDKs/MacOSX10.4u.sdk/System/Library/PrivateFrameworks/BackRow.framework/PrivateHeaders/BRDisplayLinkItemProtocol.h:8: error: syntax error before 'CVTimeStamp'
/Developer/SDKs/MacOSX10.4u.sdk/System/Library/PrivateFrameworks/BackRow.framework/PrivateHeaders/BRDisplayLinkItemProtocol.h:9: warning: '@end' must appear in an @implementation context
In file included from /Developer/SDKs/MacOSX10.4u.sdk/System/Library/PrivateFrameworks/BackRow.framework/PrivateHeaders/BRAdornedMenuItemLayer.h:7,
                 from /Developer/SDKs/MacOSX10.4u.sdk/System/Library/PrivateFrameworks/BackRow.framework/PrivateHeaders/BRAdornedMenuItemLayer-TextureCreation.h:7,
                 from /Developer/SDKs/MacOSX10.4u.sdk/System/Library/PrivateFrameworks/BackRow.framework/PrivateHeaders/BackRow.h:17,
                 from /Users/mscifo/Development/sapphire/SapphireFrappliance/../SapphireCompatibilityClasses/Sapphire_Prefix.pch:7,
                 from /Users/mscifo/Development/sapphire/SapphireFrappliance/main_rescanDir.m:21:
/Developer/SDKs/MacOSX10.4u.sdk/System/Library/PrivateFrameworks/BackRow.framework/PrivateHeaders/BRRenderLayer.h:57: error: syntax error before 'CVTimeStamp'
/Developer/SDKs/MacOSX10.4u.sdk/System/Library/PrivateFrameworks/BackRow.framework/PrivateHeaders/BRRenderLayer.h:58: fatal error: method definition not in @implementation context
compilation terminated.
{standard input}:35:FATAL:.abort  detected.  Assembly stopping.
		                 from /Users/mscifo/Development/sapphire/SapphireFrappliance/main_rescanDir.m:21:
			                 from /Users/mscifo/Development/sapphire/SapphireFrappliance/../SapphireCompatibilityClasses/Sapphire_Prefix.pch:7,
				                 from /Developer/SDKs/MacOSX10.4u.sdk/System/Library/PrivateFrameworks/BackRow.framework/PrivateHeaders/BackRow.h:17,
					                 from /Developer/SDKs/MacOSX10.4u.sdk/System/Library/PrivateFrameworks/BackRow.framework/PrivateHeaders/BRAdornedMenuItemLayer-TextureCreation.h:7,
						                 from /Developer/SDKs/MacOSX10.4u.sdk/System/Library/PrivateFrameworks/BackRow.framework/PrivateHeaders/BRAdornedMenuItemLayer.h:7,
							In file included from /Developer/SDKs/MacOSX10.4u.sdk/System/Library/PrivateFrameworks/BackRow.framework/PrivateHeaders/BRRenderLayer.h:9,
								/Developer/SDKs/MacOSX10.4u.sdk/System/Library/PrivateFrameworks/BackRow.framework/PrivateHeaders/BRDisplayLinkItemProtocol.h:8: error: syntax error before 'CVTimeStamp'
								/Developer/SDKs/MacOSX10.4u.sdk/System/Library/PrivateFrameworks/BackRow.framework/PrivateHeaders/BRDisplayLinkItemProtocol.h:9: warning: '@end' must appear in an @implementation context
		                 from /Users/mscifo/Development/sapphire/SapphireFrappliance/main_rescanDir.m:21:
			                 from /Users/mscifo/Development/sapphire/SapphireFrappliance/../SapphireCompatibilityClasses/Sapphire_Prefix.pch:7,
				                 from /Developer/SDKs/MacOSX10.4u.sdk/System/Library/PrivateFrameworks/BackRow.framework/PrivateHeaders/BackRow.h:17,
					                 from /Developer/SDKs/MacOSX10.4u.sdk/System/Library/PrivateFrameworks/BackRow.framework/PrivateHeaders/BRAdornedMenuItemLayer-TextureCreation.h:7,
						In file included from /Developer/SDKs/MacOSX10.4u.sdk/System/Library/PrivateFrameworks/BackRow.framework/PrivateHeaders/BRAdornedMenuItemLayer.h:7,
							/Developer/SDKs/MacOSX10.4u.sdk/System/Library/PrivateFrameworks/BackRow.framework/PrivateHeaders/BRRenderLayer.h:57: error: syntax error before 'CVTimeStamp'
							/Developer/SDKs/MacOSX10.4u.sdk/System/Library/PrivateFrameworks/BackRow.framework/PrivateHeaders/BRRenderLayer.h:58: fatal error: method definition not in @implementation context
Building target “Complete Sapphire” of project “Sapphire” with configuration “Release” — (1 error)
	    cd /Users/mscifo/Development/sapphire/SapphireFrappliance
    /Developer/Library/PrivateFrameworks/DevToolsCore.framework/Resources/pbxcp -exclude .DS_Store -exclude CVS -exclude .svn -strip-debug-symbols -resolve-src-symlinks /Users/mscifo/Development/sapphire/SapphireFrappliance/../build/Release/SapphireRescanDir /Users/mscifo/Development/sapphire/SapphireFrappliance/../build/Release/Sapphire.frappliance/Contents/Resources
pbxcp: SapphireRescanDir: No such file or directory
		pbxcp: SapphireRescanDir: No such file or directory
Build failed (47 errors, 6 warnings)

Change History

comment:1 Changed 4 years ago by gbooker

  • Status changed from new to closed
  • Resolution set to invalid

comment:2 Changed 4 years ago by mscifo

I followed those instructions and now I'm getting new build errors...

Building target “SapphireLeopardCompatClasses” of project “SapphireCompatibilityClasses” with configuration “Release” — (2 warnings)
	    cd /Users/mscifo/Development/sapphire/SapphireCompatibilityClasses
    /Developer/usr/bin/dsymutil /Users/mscifo/Development/sapphire/SapphireCompatibilityClasses/../build/Release/SapphireLeopardCompatClasses.framework/Versions/A/SapphireLeopardCompatClasses -o /Users/mscifo/Development/sapphire/SapphireCompatibilityClasses/../build/Release/SapphireLeopardCompatClasses.framework.dSYM
warning: no debug symbols in executable (-arch i386)
warning: no debug symbols in executable (-arch ppc7400)
		warning: no debug symbols in executable (-arch i386)
		warning: no debug symbols in executable (-arch ppc7400)
Building target “SapphireCompatClasses” of project “SapphireCompatibilityClasses” with configuration “Release” — (30 errors)
	    cd /Users/mscifo/Development/sapphire/SapphireCompatibilityClasses
    /Developer/usr/bin/gcc-4.0 -x objective-c -arch i386 -fmessage-length=0 -pipe -Wno-trigraphs -fpascal-strings -fasm-blocks -Os -Wreturn-type -Wunused-variable -isysroot /Developer/SDKs/MacOSX10.4u.sdk -mmacosx-version-min=10.4 -gdwarf-2 -I/Users/mscifo/Development/sapphire/SapphireCompatibilityClasses/../build/SapphireCompatibilityClasses.build/Release/SapphireCompatClasses.build/SapphireCompatClasses.hmap -F/Users/mscifo/Development/sapphire/SapphireCompatibilityClasses/../build/Release -F/Developer/SDKs/MacOSX10.4u.sdk/System/Library/PrivateFrameworks -F/Developer/SDKs/MacOSX10.4u.sdk/System/Library/PrivateFrameworks -I/Users/mscifo/Development/sapphire/SapphireCompatibilityClasses/../build/Release/include -I/Users/mscifo/Development/sapphire/SapphireCompatibilityClasses/../build/SapphireCompatibilityClasses.build/Release/SapphireCompatClasses.build/DerivedSources/i386 -I/Users/mscifo/Development/sapphire/SapphireCompatibilityClasses/../build/SapphireCompatibilityClasses.build/Release/SapphireCompatClasses.build/DerivedSources -include /var/folders/VY/VYbADtKZGRa4OHBFErjaDU+++TI/-Caches-/com.apple.Xcode.501/SharedPrecompiledHeaders/Sapphire_Prefix-ccniqxuydzpkhecsesgenhlblifq/Sapphire_Prefix.pch -c /Users/mscifo/Development/sapphire/SapphireCompatibilityClasses/SapphireCenteredMenuController.m -o /Users/mscifo/Development/sapphire/SapphireCompatibilityClasses/../build/SapphireCompatibilityClasses.build/Release/SapphireCompatClasses.build/Objects-normal/i386/SapphireCenteredMenuController.o
/Users/mscifo/Development/sapphire/SapphireCompatibilityClasses/SapphireCenteredMenuController.m: In function '-[SapphireWideCenteredLayout layoutSublayersOfLayer:]':
/Users/mscifo/Development/sapphire/SapphireCompatibilityClasses/SapphireCenteredMenuController.m:87: error: invalid initializer
/Users/mscifo/Development/sapphire/SapphireCompatibilityClasses/SapphireCenteredMenuController.m:96: error: invalid initializer
/Users/mscifo/Development/sapphire/SapphireCompatibilityClasses/SapphireCenteredMenuController.m:98: error: incompatible type for argument 1 of 'setFrame:'
/Users/mscifo/Development/sapphire/SapphireCompatibilityClasses/SapphireCenteredMenuController.m: In function '-[SapphireWideCenteredLayout preferredSizeOfLayer:]':
/Users/mscifo/Development/sapphire/SapphireCompatibilityClasses/SapphireCenteredMenuController.m:102: error: incompatible types in return
/Users/mscifo/Development/sapphire/SapphireCompatibilityClasses/SapphireCenteredMenuController.m: In function '-[SapphireCenteredMenuController _doLayout]':
/Users/mscifo/Development/sapphire/SapphireCompatibilityClasses/SapphireCenteredMenuController.m:154: error: invalid initializer
/Users/mscifo/Development/sapphire/SapphireCompatibilityClasses/SapphireCenteredMenuController.m:156: error: incompatible type for argument 1 of 'setFrame:'
		/Users/mscifo/Development/sapphire/SapphireCompatibilityClasses/SapphireCenteredMenuController.m:87: error: invalid initializer
		/Users/mscifo/Development/sapphire/SapphireCompatibilityClasses/SapphireCenteredMenuController.m:96: error: invalid initializer
		/Users/mscifo/Development/sapphire/SapphireCompatibilityClasses/SapphireCenteredMenuController.m:98: error: incompatible type for argument 1 of 'setFrame:'
		/Users/mscifo/Development/sapphire/SapphireCompatibilityClasses/SapphireCenteredMenuController.m:102: error: incompatible types in return
		/Users/mscifo/Development/sapphire/SapphireCompatibilityClasses/SapphireCenteredMenuController.m:154: error: invalid initializer
		/Users/mscifo/Development/sapphire/SapphireCompatibilityClasses/SapphireCenteredMenuController.m:156: error: incompatible type for argument 1 of 'setFrame:'
	    cd /Users/mscifo/Development/sapphire/SapphireCompatibilityClasses
    /Developer/usr/bin/gcc-4.0 -x objective-c -arch i386 -fmessage-length=0 -pipe -Wno-trigraphs -fpascal-strings -fasm-blocks -Os -Wreturn-type -Wunused-variable -isysroot /Developer/SDKs/MacOSX10.4u.sdk -mmacosx-version-min=10.4 -gdwarf-2 -I/Users/mscifo/Development/sapphire/SapphireCompatibilityClasses/../build/SapphireCompatibilityClasses.build/Release/SapphireCompatClasses.build/SapphireCompatClasses.hmap -F/Users/mscifo/Development/sapphire/SapphireCompatibilityClasses/../build/Release -F/Developer/SDKs/MacOSX10.4u.sdk/System/Library/PrivateFrameworks -F/Developer/SDKs/MacOSX10.4u.sdk/System/Library/PrivateFrameworks -I/Users/mscifo/Development/sapphire/SapphireCompatibilityClasses/../build/Release/include -I/Users/mscifo/Development/sapphire/SapphireCompatibilityClasses/../build/SapphireCompatibilityClasses.build/Release/SapphireCompatClasses.build/DerivedSources/i386 -I/Users/mscifo/Development/sapphire/SapphireCompatibilityClasses/../build/SapphireCompatibilityClasses.build/Release/SapphireCompatClasses.build/DerivedSources -include /var/folders/VY/VYbADtKZGRa4OHBFErjaDU+++TI/-Caches-/com.apple.Xcode.501/SharedPrecompiledHeaders/Sapphire_Prefix-ccniqxuydzpkhecsesgenhlblifq/Sapphire_Prefix.pch -c /Users/mscifo/Development/sapphire/SapphireCompatibilityClasses/SapphireFrontRowCompat.m -o /Users/mscifo/Development/sapphire/SapphireCompatibilityClasses/../build/SapphireCompatibilityClasses.build/Release/SapphireCompatClasses.build/Objects-normal/i386/SapphireFrontRowCompat.o
/Users/mscifo/Development/sapphire/SapphireCompatibilityClasses/SapphireFrontRowCompat.m: In function '+[SapphireFrontRowCompat frameOfController:]':
/Users/mscifo/Development/sapphire/SapphireCompatibilityClasses/SapphireFrontRowCompat.m:376: error: incompatible types in return
/Users/mscifo/Development/sapphire/SapphireCompatibilityClasses/SapphireFrontRowCompat.m:381: error: incompatible types in return
		/Users/mscifo/Development/sapphire/SapphireCompatibilityClasses/SapphireFrontRowCompat.m:376: error: incompatible types in return
		/Users/mscifo/Development/sapphire/SapphireCompatibilityClasses/SapphireFrontRowCompat.m:381: error: incompatible types in return
	    cd /Users/mscifo/Development/sapphire/SapphireCompatibilityClasses
    /Developer/usr/bin/gcc-4.0 -x objective-c -arch i386 -fmessage-length=0 -pipe -Wno-trigraphs -fpascal-strings -fasm-blocks -Os -Wreturn-type -Wunused-variable -isysroot /Developer/SDKs/MacOSX10.4u.sdk -mmacosx-version-min=10.4 -gdwarf-2 -I/Users/mscifo/Development/sapphire/SapphireCompatibilityClasses/../build/SapphireCompatibilityClasses.build/Release/SapphireCompatClasses.build/SapphireCompatClasses.hmap -F/Users/mscifo/Development/sapphire/SapphireCompatibilityClasses/../build/Release -F/Developer/SDKs/MacOSX10.4u.sdk/System/Library/PrivateFrameworks -F/Developer/SDKs/MacOSX10.4u.sdk/System/Library/PrivateFrameworks -I/Users/mscifo/Development/sapphire/SapphireCompatibilityClasses/../build/Release/include -I/Users/mscifo/Development/sapphire/SapphireCompatibilityClasses/../build/SapphireCompatibilityClasses.build/Release/SapphireCompatClasses.build/DerivedSources/i386 -I/Users/mscifo/Development/sapphire/SapphireCompatibilityClasses/../build/SapphireCompatibilityClasses.build/Release/SapphireCompatClasses.build/DerivedSources -include /var/folders/VY/VYbADtKZGRa4OHBFErjaDU+++TI/-Caches-/com.apple.Xcode.501/SharedPrecompiledHeaders/Sapphire_Prefix-ccniqxuydzpkhecsesgenhlblifq/Sapphire_Prefix.pch -c /Users/mscifo/Development/sapphire/SapphireCompatibilityClasses/SapphireMediaMenuController.m -o /Users/mscifo/Development/sapphire/SapphireCompatibilityClasses/../build/SapphireCompatibilityClasses.build/Release/SapphireCompatClasses.build/Objects-normal/i386/SapphireMediaMenuController.o
/Users/mscifo/Development/sapphire/SapphireCompatibilityClasses/SapphireMediaMenuController.m: In function '-[SapphireCustomMediaLayout layoutSublayersOfLayer:]':
/Users/mscifo/Development/sapphire/SapphireCompatibilityClasses/SapphireMediaMenuController.m:88: error: invalid initializer
/Users/mscifo/Development/sapphire/SapphireCompatibilityClasses/SapphireMediaMenuController.m:97: error: invalid initializer
/Users/mscifo/Development/sapphire/SapphireCompatibilityClasses/SapphireMediaMenuController.m:99: error: incompatible type for argument 1 of 'setFrame:'
/Users/mscifo/Development/sapphire/SapphireCompatibilityClasses/SapphireMediaMenuController.m: In function '-[SapphireCustomMediaLayout preferredSizeOfLayer:]':
/Users/mscifo/Development/sapphire/SapphireCompatibilityClasses/SapphireMediaMenuController.m:103: error: incompatible types in return
/Users/mscifo/Development/sapphire/SapphireCompatibilityClasses/SapphireMediaMenuController.m: In function '-[SapphireMediaMenuController _doLayout]':
/Users/mscifo/Development/sapphire/SapphireCompatibilityClasses/SapphireMediaMenuController.m:151: error: invalid initializer
/Users/mscifo/Development/sapphire/SapphireCompatibilityClasses/SapphireMediaMenuController.m:153: error: incompatible type for argument 1 of 'setFrame:'
		/Users/mscifo/Development/sapphire/SapphireCompatibilityClasses/SapphireMediaMenuController.m:88: error: invalid initializer
		/Users/mscifo/Development/sapphire/SapphireCompatibilityClasses/SapphireMediaMenuController.m:97: error: invalid initializer
		/Users/mscifo/Development/sapphire/SapphireCompatibilityClasses/SapphireMediaMenuController.m:99: error: incompatible type for argument 1 of 'setFrame:'
		/Users/mscifo/Development/sapphire/SapphireCompatibilityClasses/SapphireMediaMenuController.m:103: error: incompatible types in return
		/Users/mscifo/Development/sapphire/SapphireCompatibilityClasses/SapphireMediaMenuController.m:151: error: invalid initializer
		/Users/mscifo/Development/sapphire/SapphireCompatibilityClasses/SapphireMediaMenuController.m:153: error: incompatible type for argument 1 of 'setFrame:'
	    cd /Users/mscifo/Development/sapphire/SapphireCompatibilityClasses
    /Developer/usr/bin/gcc-4.0 -x objective-c -arch i386 -fmessage-length=0 -pipe -Wno-trigraphs -fpascal-strings -fasm-blocks -Os -Wreturn-type -Wunused-variable -isysroot /Developer/SDKs/MacOSX10.4u.sdk -mmacosx-version-min=10.4 -gdwarf-2 -I/Users/mscifo/Development/sapphire/SapphireCompatibilityClasses/../build/SapphireCompatibilityClasses.build/Release/SapphireCompatClasses.build/SapphireCompatClasses.hmap -F/Users/mscifo/Development/sapphire/SapphireCompatibilityClasses/../build/Release -F/Developer/SDKs/MacOSX10.4u.sdk/System/Library/PrivateFrameworks -F/Developer/SDKs/MacOSX10.4u.sdk/System/Library/PrivateFrameworks -I/Users/mscifo/Development/sapphire/SapphireCompatibilityClasses/../build/Release/include -I/Users/mscifo/Development/sapphire/SapphireCompatibilityClasses/../build/SapphireCompatibilityClasses.build/Release/SapphireCompatClasses.build/DerivedSources/i386 -I/Users/mscifo/Development/sapphire/SapphireCompatibilityClasses/../build/SapphireCompatibilityClasses.build/Release/SapphireCompatClasses.build/DerivedSources -include /var/folders/VY/VYbADtKZGRa4OHBFErjaDU+++TI/-Caches-/com.apple.Xcode.501/SharedPrecompiledHeaders/Sapphire_Prefix-ccniqxuydzpkhecsesgenhlblifq/Sapphire_Prefix.pch -c /Users/mscifo/Development/sapphire/SapphireCompatibilityClasses/SapphireLayoutManager.m -o /Users/mscifo/Development/sapphire/SapphireCompatibilityClasses/../build/SapphireCompatibilityClasses.build/Release/SapphireCompatClasses.build/Objects-normal/i386/SapphireLayoutManager.o
/Users/mscifo/Development/sapphire/SapphireCompatibilityClasses/SapphireLayoutManager.m: In function '-[SapphireLayoutManager preferredSizeOfLayer:]':
/Users/mscifo/Development/sapphire/SapphireCompatibilityClasses/SapphireLayoutManager.m:74: error: incompatible types in return
		/Users/mscifo/Development/sapphire/SapphireCompatibilityClasses/SapphireLayoutManager.m:74: error: incompatible types in return
	    cd /Users/mscifo/Development/sapphire/SapphireCompatibilityClasses
    /Developer/usr/bin/gcc-4.0 -x objective-c -arch ppc -mcpu=G4 -fmessage-length=0 -pipe -Wno-trigraphs -fpascal-strings -Os -Wreturn-type -Wunused-variable -isysroot /Developer/SDKs/MacOSX10.4u.sdk -mtune=G5 -mmacosx-version-min=10.4 -gdwarf-2 -I/Users/mscifo/Development/sapphire/SapphireCompatibilityClasses/../build/SapphireCompatibilityClasses.build/Release/SapphireCompatClasses.build/SapphireCompatClasses.hmap -F/Users/mscifo/Development/sapphire/SapphireCompatibilityClasses/../build/Release -F/Developer/SDKs/MacOSX10.4u.sdk/System/Library/PrivateFrameworks -F/Developer/SDKs/MacOSX10.4u.sdk/System/Library/PrivateFrameworks -I/Users/mscifo/Development/sapphire/SapphireCompatibilityClasses/../build/Release/include -I/Users/mscifo/Development/sapphire/SapphireCompatibilityClasses/../build/SapphireCompatibilityClasses.build/Release/SapphireCompatClasses.build/DerivedSources/ppc7400 -I/Users/mscifo/Development/sapphire/SapphireCompatibilityClasses/../build/SapphireCompatibilityClasses.build/Release/SapphireCompatClasses.build/DerivedSources -include /var/folders/VY/VYbADtKZGRa4OHBFErjaDU+++TI/-Caches-/com.apple.Xcode.501/SharedPrecompiledHeaders/Sapphire_Prefix-cynxthbkwvkbmngkiducbghjltao/Sapphire_Prefix.pch -c /Users/mscifo/Development/sapphire/SapphireCompatibilityClasses/SapphireCenteredMenuController.m -o /Users/mscifo/Development/sapphire/SapphireCompatibilityClasses/../build/SapphireCompatibilityClasses.build/Release/SapphireCompatClasses.build/Objects-normal/ppc7400/SapphireCenteredMenuController.o
/Users/mscifo/Development/sapphire/SapphireCompatibilityClasses/SapphireCenteredMenuController.m: In function '-[SapphireWideCenteredLayout layoutSublayersOfLayer:]':
/Users/mscifo/Development/sapphire/SapphireCompatibilityClasses/SapphireCenteredMenuController.m:87: error: invalid initializer
/Users/mscifo/Development/sapphire/SapphireCompatibilityClasses/SapphireCenteredMenuController.m:96: error: invalid initializer
/Users/mscifo/Development/sapphire/SapphireCompatibilityClasses/SapphireCenteredMenuController.m:98: error: incompatible type for argument 1 of 'setFrame:'
/Users/mscifo/Development/sapphire/SapphireCompatibilityClasses/SapphireCenteredMenuController.m: In function '-[SapphireWideCenteredLayout preferredSizeOfLayer:]':
/Users/mscifo/Development/sapphire/SapphireCompatibilityClasses/SapphireCenteredMenuController.m:102: error: incompatible types in return
/Users/mscifo/Development/sapphire/SapphireCompatibilityClasses/SapphireCenteredMenuController.m: In function '-[SapphireCenteredMenuController _doLayout]':
/Users/mscifo/Development/sapphire/SapphireCompatibilityClasses/SapphireCenteredMenuController.m:154: error: invalid initializer
/Users/mscifo/Development/sapphire/SapphireCompatibilityClasses/SapphireCenteredMenuController.m:156: error: incompatible type for argument 1 of 'setFrame:'
		/Users/mscifo/Development/sapphire/SapphireCompatibilityClasses/SapphireCenteredMenuController.m:87: error: invalid initializer
		/Users/mscifo/Development/sapphire/SapphireCompatibilityClasses/SapphireCenteredMenuController.m:96: error: invalid initializer
		/Users/mscifo/Development/sapphire/SapphireCompatibilityClasses/SapphireCenteredMenuController.m:98: error: incompatible type for argument 1 of 'setFrame:'
		/Users/mscifo/Development/sapphire/SapphireCompatibilityClasses/SapphireCenteredMenuController.m:102: error: incompatible types in return
		/Users/mscifo/Development/sapphire/SapphireCompatibilityClasses/SapphireCenteredMenuController.m:154: error: invalid initializer
		/Users/mscifo/Development/sapphire/SapphireCompatibilityClasses/SapphireCenteredMenuController.m:156: error: incompatible type for argument 1 of 'setFrame:'
	    cd /Users/mscifo/Development/sapphire/SapphireCompatibilityClasses
    /Developer/usr/bin/gcc-4.0 -x objective-c -arch ppc -mcpu=G4 -fmessage-length=0 -pipe -Wno-trigraphs -fpascal-strings -Os -Wreturn-type -Wunused-variable -isysroot /Developer/SDKs/MacOSX10.4u.sdk -mtune=G5 -mmacosx-version-min=10.4 -gdwarf-2 -I/Users/mscifo/Development/sapphire/SapphireCompatibilityClasses/../build/SapphireCompatibilityClasses.build/Release/SapphireCompatClasses.build/SapphireCompatClasses.hmap -F/Users/mscifo/Development/sapphire/SapphireCompatibilityClasses/../build/Release -F/Developer/SDKs/MacOSX10.4u.sdk/System/Library/PrivateFrameworks -F/Developer/SDKs/MacOSX10.4u.sdk/System/Library/PrivateFrameworks -I/Users/mscifo/Development/sapphire/SapphireCompatibilityClasses/../build/Release/include -I/Users/mscifo/Development/sapphire/SapphireCompatibilityClasses/../build/SapphireCompatibilityClasses.build/Release/SapphireCompatClasses.build/DerivedSources/ppc7400 -I/Users/mscifo/Development/sapphire/SapphireCompatibilityClasses/../build/SapphireCompatibilityClasses.build/Release/SapphireCompatClasses.build/DerivedSources -include /var/folders/VY/VYbADtKZGRa4OHBFErjaDU+++TI/-Caches-/com.apple.Xcode.501/SharedPrecompiledHeaders/Sapphire_Prefix-cynxthbkwvkbmngkiducbghjltao/Sapphire_Prefix.pch -c /Users/mscifo/Development/sapphire/SapphireCompatibilityClasses/SapphireFrontRowCompat.m -o /Users/mscifo/Development/sapphire/SapphireCompatibilityClasses/../build/SapphireCompatibilityClasses.build/Release/SapphireCompatClasses.build/Objects-normal/ppc7400/SapphireFrontRowCompat.o
/Users/mscifo/Development/sapphire/SapphireCompatibilityClasses/SapphireFrontRowCompat.m: In function '+[SapphireFrontRowCompat frameOfController:]':
/Users/mscifo/Development/sapphire/SapphireCompatibilityClasses/SapphireFrontRowCompat.m:376: error: incompatible types in return
/Users/mscifo/Development/sapphire/SapphireCompatibilityClasses/SapphireFrontRowCompat.m:381: error: incompatible types in return
		/Users/mscifo/Development/sapphire/SapphireCompatibilityClasses/SapphireFrontRowCompat.m:376: error: incompatible types in return
		/Users/mscifo/Development/sapphire/SapphireCompatibilityClasses/SapphireFrontRowCompat.m:381: error: incompatible types in return
	    cd /Users/mscifo/Development/sapphire/SapphireCompatibilityClasses
    /Developer/usr/bin/gcc-4.0 -x objective-c -arch ppc -mcpu=G4 -fmessage-length=0 -pipe -Wno-trigraphs -fpascal-strings -Os -Wreturn-type -Wunused-variable -isysroot /Developer/SDKs/MacOSX10.4u.sdk -mtune=G5 -mmacosx-version-min=10.4 -gdwarf-2 -I/Users/mscifo/Development/sapphire/SapphireCompatibilityClasses/../build/SapphireCompatibilityClasses.build/Release/SapphireCompatClasses.build/SapphireCompatClasses.hmap -F/Users/mscifo/Development/sapphire/SapphireCompatibilityClasses/../build/Release -F/Developer/SDKs/MacOSX10.4u.sdk/System/Library/PrivateFrameworks -F/Developer/SDKs/MacOSX10.4u.sdk/System/Library/PrivateFrameworks -I/Users/mscifo/Development/sapphire/SapphireCompatibilityClasses/../build/Release/include -I/Users/mscifo/Development/sapphire/SapphireCompatibilityClasses/../build/SapphireCompatibilityClasses.build/Release/SapphireCompatClasses.build/DerivedSources/ppc7400 -I/Users/mscifo/Development/sapphire/SapphireCompatibilityClasses/../build/SapphireCompatibilityClasses.build/Release/SapphireCompatClasses.build/DerivedSources -include /var/folders/VY/VYbADtKZGRa4OHBFErjaDU+++TI/-Caches-/com.apple.Xcode.501/SharedPrecompiledHeaders/Sapphire_Prefix-cynxthbkwvkbmngkiducbghjltao/Sapphire_Prefix.pch -c /Users/mscifo/Development/sapphire/SapphireCompatibilityClasses/SapphireMediaMenuController.m -o /Users/mscifo/Development/sapphire/SapphireCompatibilityClasses/../build/SapphireCompatibilityClasses.build/Release/SapphireCompatClasses.build/Objects-normal/ppc7400/SapphireMediaMenuController.o
/Users/mscifo/Development/sapphire/SapphireCompatibilityClasses/SapphireMediaMenuController.m: In function '-[SapphireCustomMediaLayout layoutSublayersOfLayer:]':
/Users/mscifo/Development/sapphire/SapphireCompatibilityClasses/SapphireMediaMenuController.m:88: error: invalid initializer
/Users/mscifo/Development/sapphire/SapphireCompatibilityClasses/SapphireMediaMenuController.m:97: error: invalid initializer
/Users/mscifo/Development/sapphire/SapphireCompatibilityClasses/SapphireMediaMenuController.m:99: error: incompatible type for argument 1 of 'setFrame:'
/Users/mscifo/Development/sapphire/SapphireCompatibilityClasses/SapphireMediaMenuController.m: In function '-[SapphireCustomMediaLayout preferredSizeOfLayer:]':
/Users/mscifo/Development/sapphire/SapphireCompatibilityClasses/SapphireMediaMenuController.m:103: error: incompatible types in return
/Users/mscifo/Development/sapphire/SapphireCompatibilityClasses/SapphireMediaMenuController.m: In function '-[SapphireMediaMenuController _doLayout]':
/Users/mscifo/Development/sapphire/SapphireCompatibilityClasses/SapphireMediaMenuController.m:151: error: invalid initializer
/Users/mscifo/Development/sapphire/SapphireCompatibilityClasses/SapphireMediaMenuController.m:153: error: incompatible type for argument 1 of 'setFrame:'
		/Users/mscifo/Development/sapphire/SapphireCompatibilityClasses/SapphireMediaMenuController.m:88: error: invalid initializer
		/Users/mscifo/Development/sapphire/SapphireCompatibilityClasses/SapphireMediaMenuController.m:97: error: invalid initializer
		/Users/mscifo/Development/sapphire/SapphireCompatibilityClasses/SapphireMediaMenuController.m:99: error: incompatible type for argument 1 of 'setFrame:'
		/Users/mscifo/Development/sapphire/SapphireCompatibilityClasses/SapphireMediaMenuController.m:103: error: incompatible types in return
		/Users/mscifo/Development/sapphire/SapphireCompatibilityClasses/SapphireMediaMenuController.m:151: error: invalid initializer
		/Users/mscifo/Development/sapphire/SapphireCompatibilityClasses/SapphireMediaMenuController.m:153: error: incompatible type for argument 1 of 'setFrame:'
	    cd /Users/mscifo/Development/sapphire/SapphireCompatibilityClasses
    /Developer/usr/bin/gcc-4.0 -x objective-c -arch ppc -mcpu=G4 -fmessage-length=0 -pipe -Wno-trigraphs -fpascal-strings -Os -Wreturn-type -Wunused-variable -isysroot /Developer/SDKs/MacOSX10.4u.sdk -mtune=G5 -mmacosx-version-min=10.4 -gdwarf-2 -I/Users/mscifo/Development/sapphire/SapphireCompatibilityClasses/../build/SapphireCompatibilityClasses.build/Release/SapphireCompatClasses.build/SapphireCompatClasses.hmap -F/Users/mscifo/Development/sapphire/SapphireCompatibilityClasses/../build/Release -F/Developer/SDKs/MacOSX10.4u.sdk/System/Library/PrivateFrameworks -F/Developer/SDKs/MacOSX10.4u.sdk/System/Library/PrivateFrameworks -I/Users/mscifo/Development/sapphire/SapphireCompatibilityClasses/../build/Release/include -I/Users/mscifo/Development/sapphire/SapphireCompatibilityClasses/../build/SapphireCompatibilityClasses.build/Release/SapphireCompatClasses.build/DerivedSources/ppc7400 -I/Users/mscifo/Development/sapphire/SapphireCompatibilityClasses/../build/SapphireCompatibilityClasses.build/Release/SapphireCompatClasses.build/DerivedSources -include /var/folders/VY/VYbADtKZGRa4OHBFErjaDU+++TI/-Caches-/com.apple.Xcode.501/SharedPrecompiledHeaders/Sapphire_Prefix-cynxthbkwvkbmngkiducbghjltao/Sapphire_Prefix.pch -c /Users/mscifo/Development/sapphire/SapphireCompatibilityClasses/SapphireLayoutManager.m -o /Users/mscifo/Development/sapphire/SapphireCompatibilityClasses/../build/SapphireCompatibilityClasses.build/Release/SapphireCompatClasses.build/Objects-normal/ppc7400/SapphireLayoutManager.o
/Users/mscifo/Development/sapphire/SapphireCompatibilityClasses/SapphireLayoutManager.m: In function '-[SapphireLayoutManager preferredSizeOfLayer:]':
/Users/mscifo/Development/sapphire/SapphireCompatibilityClasses/SapphireLayoutManager.m:74: error: incompatible types in return
		/Users/mscifo/Development/sapphire/SapphireCompatibilityClasses/SapphireLayoutManager.m:74: error: incompatible types in return
Building target “Sapphire” of project “Sapphire” with configuration “Release” — (18 errors, 62 warnings)
	    cd /Users/mscifo/Development/sapphire/SapphireFrappliance
    /Developer/usr/bin/gcc-4.0 -x objective-c -arch i386 -fmessage-length=0 -pipe -Wno-trigraphs -fpascal-strings -fasm-blocks -O3 -Wreturn-type -Wunused-variable -isysroot /Developer/SDKs/MacOSX10.4u.sdk -mmacosx-version-min=10.4 -gdwarf-2 -I/Users/mscifo/Development/sapphire/SapphireFrappliance/../build/Sapphire.build/Release/Sapphire.build/Sapphire.hmap -F/Users/mscifo/Development/sapphire/SapphireFrappliance/../build/Release -F/Developer/SDKs/MacOSX10.4u.sdk/System/Library/PrivateFrameworks -F/Developer/SDKs/MacOSX10.4u.sdk/System/Library/PrivateFrameworks -I/Users/mscifo/Development/sapphire/SapphireFrappliance/../build/Release/include -I/Users/mscifo/Development/sapphire/SapphireFrappliance/../build/Sapphire.build/Release/Sapphire.build/DerivedSources/i386 -I/Users/mscifo/Development/sapphire/SapphireFrappliance/../build/Sapphire.build/Release/Sapphire.build/DerivedSources -include /var/folders/VY/VYbADtKZGRa4OHBFErjaDU+++TI/-Caches-/com.apple.Xcode.501/SharedPrecompiledHeaders/Sapphire_Prefix-bscdmphjxtuegeatjkbrhiwtgpcz/Sapphire_Prefix.pch -c /Users/mscifo/Development/sapphire/SapphireFrappliance/MetaDataImporting/SapphireTVShowImporter.m -o /Users/mscifo/Development/sapphire/SapphireFrappliance/../build/Sapphire.build/Release/Sapphire.build/Objects-normal/i386/SapphireTVShowImporter.o
/Users/mscifo/Development/sapphire/SapphireFrappliance/MetaDataImporting/SapphireTVShowImporter.m: In function '-[SapphireTVShowImporter retrievedSearchResuls:forObject:]':
/Users/mscifo/Development/sapphire/SapphireFrappliance/MetaDataImporting/SapphireTVShowImporter.m:234: warning: conflicting types for '-(void)retrievedSearchResuls:(NSXMLDocument *)results forObject:(SapphireTVShowImportStateData *)state'
/Users/mscifo/Development/sapphire/SapphireFrappliance/MetaDataImporting/SapphireSiteScraper.h:24: warning: previous declaration of '-(void)retrievedSearchResuls:(NSXMLDocument *)results forObject:(id)object'
/Users/mscifo/Development/sapphire/SapphireFrappliance/MetaDataImporting/SapphireTVShowImporter.m: In function '-[SapphireTVShowImporter getTVShowResultsForState:]':
/Users/mscifo/Development/sapphire/SapphireFrappliance/MetaDataImporting/SapphireTVShowImporter.m:309: warning: unused variable 'isDir'
/Users/mscifo/Development/sapphire/SapphireFrappliance/MetaDataImporting/SapphireTVShowImporter.m: In function '-[SapphireTVShowImporter retrievedShowDetails:forObject:]':
/Users/mscifo/Development/sapphire/SapphireFrappliance/MetaDataImporting/SapphireTVShowImporter.m:328: warning: conflicting types for '-(void)retrievedShowDetails:(NSXMLDocument *)details forObject:(SapphireTVShowImportStateData *)state'
/Users/mscifo/Development/sapphire/SapphireFrappliance/MetaDataImporting/SapphireSiteScraper.h:33: warning: previous declaration of '-(void)retrievedShowDetails:(NSXMLDocument *)details forObject:(id)object'
/Users/mscifo/Development/sapphire/SapphireFrappliance/MetaDataImporting/SapphireTVShowImporter.m: In function '-[SapphireTVShowImporter retrievedEpisodeList:forObject:]':
/Users/mscifo/Development/sapphire/SapphireFrappliance/MetaDataImporting/SapphireTVShowImporter.m:411: warning: conflicting types for '-(void)retrievedEpisodeList:(NSXMLDocument *)episodeList forObject:(SapphireTVShowImportStateData *)state'
/Users/mscifo/Development/sapphire/SapphireFrappliance/MetaDataImporting/SapphireSiteScraper.h:34: warning: previous declaration of '-(void)retrievedEpisodeList:(NSXMLDocument *)episodeList forObject:(id)object'
/Users/mscifo/Development/sapphire/SapphireFrappliance/MetaDataImporting/SapphireTVShowImporter.m: In function '-[SapphireTVShowImporter retrievedEpisodeDetails:forObject:]':
/Users/mscifo/Development/sapphire/SapphireFrappliance/MetaDataImporting/SapphireTVShowImporter.m:438: warning: conflicting types for '-(void)retrievedEpisodeDetails:(NSXMLDocument *)details forObject:(SapphireSingleTVShowEpisodeImportStateData *)state'
/Users/mscifo/Development/sapphire/SapphireFrappliance/MetaDataImporting/SapphireSiteScraper.h:35: warning: previous declaration of '-(void)retrievedEpisodeDetails:(NSXMLDocument *)details forObject:(id)object'
/Users/mscifo/Development/sapphire/SapphireFrappliance/MetaDataImporting/SapphireTVShowImporter.m: In function '-[SapphireTVShowImporter completedEpisode:forState:atIndex:]':
/Users/mscifo/Development/sapphire/SapphireFrappliance/MetaDataImporting/SapphireTVShowImporter.m:515: error: 'for' loop initial declaration used outside C99 mode
/Users/mscifo/Development/sapphire/SapphireFrappliance/MetaDataImporting/SapphireTVShowImporter.m: In function '-[SapphireTVShowImporter stillNeedsDisplayOfChooser:withContext:]':
/Users/mscifo/Development/sapphire/SapphireFrappliance/MetaDataImporting/SapphireTVShowImporter.m:759: warning: conflicting types for '-(BOOL)stillNeedsDisplayOfChooser:(BRLayerController <SapphireChooser> *)chooser withContext:(SapphireTVShowImportStateData *)state'
/Users/mscifo/Development/sapphire/SapphireFrappliance/MetaDataImporting/SapphireImporterDataMenu.h:113: warning: previous declaration of '-(BOOL)stillNeedsDisplayOfChooser:(BRLayerController <SapphireChooser> *)chooser withContext:(id)context'
/Users/mscifo/Development/sapphire/SapphireFrappliance/MetaDataImporting/SapphireTVShowImporter.m: In function '-[SapphireTVShowImporter exhumedChooser:withContext:]':
/Users/mscifo/Development/sapphire/SapphireFrappliance/MetaDataImporting/SapphireTVShowImporter.m:772: warning: conflicting types for '-(void)exhumedChooser:(BRLayerController <SapphireChooser> *)aChooser withContext:(SapphireTVShowImportStateData *)state'
/Users/mscifo/Development/sapphire/SapphireFrappliance/MetaDataImporting/SapphireImporterDataMenu.h:123: warning: previous declaration of '-(void)exhumedChooser:(BRLayerController <SapphireChooser> *)chooser withContext:(id)context'
		/Users/mscifo/Development/sapphire/SapphireFrappliance/MetaDataImporting/SapphireTVShowImporter.m:234: warning: conflicting types for '-(void)retrievedSearchResuls:(NSXMLDocument *)results forObject:(SapphireTVShowImportStateData *)state'
		/Users/mscifo/Development/sapphire/SapphireFrappliance/MetaDataImporting/SapphireSiteScraper.h:24: warning: previous declaration of '-(void)retrievedSearchResuls:(NSXMLDocument *)results forObject:(id)object'
		/Users/mscifo/Development/sapphire/SapphireFrappliance/MetaDataImporting/SapphireTVShowImporter.m:309: warning: unused variable 'isDir'
		/Users/mscifo/Development/sapphire/SapphireFrappliance/MetaDataImporting/SapphireTVShowImporter.m:328: warning: conflicting types for '-(void)retrievedShowDetails:(NSXMLDocument *)details forObject:(SapphireTVShowImportStateData *)state'
		/Users/mscifo/Development/sapphire/SapphireFrappliance/MetaDataImporting/SapphireSiteScraper.h:33: warning: previous declaration of '-(void)retrievedShowDetails:(NSXMLDocument *)details forObject:(id)object'
		/Users/mscifo/Development/sapphire/SapphireFrappliance/MetaDataImporting/SapphireTVShowImporter.m:411: warning: conflicting types for '-(void)retrievedEpisodeList:(NSXMLDocument *)episodeList forObject:(SapphireTVShowImportStateData *)state'
		/Users/mscifo/Development/sapphire/SapphireFrappliance/MetaDataImporting/SapphireSiteScraper.h:34: warning: previous declaration of '-(void)retrievedEpisodeList:(NSXMLDocument *)episodeList forObject:(id)object'
		/Users/mscifo/Development/sapphire/SapphireFrappliance/MetaDataImporting/SapphireTVShowImporter.m:438: warning: conflicting types for '-(void)retrievedEpisodeDetails:(NSXMLDocument *)details forObject:(SapphireSingleTVShowEpisodeImportStateData *)state'
		/Users/mscifo/Development/sapphire/SapphireFrappliance/MetaDataImporting/SapphireSiteScraper.h:35: warning: previous declaration of '-(void)retrievedEpisodeDetails:(NSXMLDocument *)details forObject:(id)object'
		/Users/mscifo/Development/sapphire/SapphireFrappliance/MetaDataImporting/SapphireTVShowImporter.m:515: error: 'for' loop initial declaration used outside C99 mode
		/Users/mscifo/Development/sapphire/SapphireFrappliance/MetaDataImporting/SapphireTVShowImporter.m:759: warning: conflicting types for '-(BOOL)stillNeedsDisplayOfChooser:(BRLayerController <SapphireChooser> *)chooser withContext:(SapphireTVShowImportStateData *)state'
		/Users/mscifo/Development/sapphire/SapphireFrappliance/MetaDataImporting/SapphireImporterDataMenu.h:113: warning: previous declaration of '-(BOOL)stillNeedsDisplayOfChooser:(BRLayerController <SapphireChooser> *)chooser withContext:(id)context'
		/Users/mscifo/Development/sapphire/SapphireFrappliance/MetaDataImporting/SapphireTVShowImporter.m:772: warning: conflicting types for '-(void)exhumedChooser:(BRLayerController <SapphireChooser> *)aChooser withContext:(SapphireTVShowImportStateData *)state'
		/Users/mscifo/Development/sapphire/SapphireFrappliance/MetaDataImporting/SapphireImporterDataMenu.h:123: warning: previous declaration of '-(void)exhumedChooser:(BRLayerController <SapphireChooser> *)chooser withContext:(id)context'
	    cd /Users/mscifo/Development/sapphire/SapphireFrappliance
    /Developer/usr/bin/gcc-4.0 -x objective-c -arch i386 -fmessage-length=0 -pipe -Wno-trigraphs -fpascal-strings -fasm-blocks -O3 -Wreturn-type -Wunused-variable -isysroot /Developer/SDKs/MacOSX10.4u.sdk -mmacosx-version-min=10.4 -gdwarf-2 -I/Users/mscifo/Development/sapphire/SapphireFrappliance/../build/Sapphire.build/Release/Sapphire.build/Sapphire.hmap -F/Users/mscifo/Development/sapphire/SapphireFrappliance/../build/Release -F/Developer/SDKs/MacOSX10.4u.sdk/System/Library/PrivateFrameworks -F/Developer/SDKs/MacOSX10.4u.sdk/System/Library/PrivateFrameworks -I/Users/mscifo/Development/sapphire/SapphireFrappliance/../build/Release/include -I/Users/mscifo/Development/sapphire/SapphireFrappliance/../build/Sapphire.build/Release/Sapphire.build/DerivedSources/i386 -I/Users/mscifo/Development/sapphire/SapphireFrappliance/../build/Sapphire.build/Release/Sapphire.build/DerivedSources -include /var/folders/VY/VYbADtKZGRa4OHBFErjaDU+++TI/-Caches-/com.apple.Xcode.501/SharedPrecompiledHeaders/Sapphire_Prefix-bscdmphjxtuegeatjkbrhiwtgpcz/Sapphire_Prefix.pch -c /Users/mscifo/Development/sapphire/SapphireFrappliance/MetaDataImporting/SapphireAllImporter.m -o /Users/mscifo/Development/sapphire/SapphireFrappliance/../build/Sapphire.build/Release/Sapphire.build/Objects-normal/i386/SapphireAllImporter.o
/Users/mscifo/Development/sapphire/SapphireFrappliance/MetaDataImporting/SapphireAllImporter.m:66: warning: incomplete implementation of class 'SapphireAllImporter'
/Users/mscifo/Development/sapphire/SapphireFrappliance/MetaDataImporting/SapphireAllImporter.m:66: warning: method definition for '-stillNeedsDisplayOfChooser:withContext:' not found
/Users/mscifo/Development/sapphire/SapphireFrappliance/MetaDataImporting/SapphireAllImporter.m:66: warning: class 'SapphireAllImporter' does not fully implement the 'SapphireImporter' protocol
		/Users/mscifo/Development/sapphire/SapphireFrappliance/MetaDataImporting/SapphireAllImporter.m:66: warning: incomplete implementation of class 'SapphireAllImporter'
		/Users/mscifo/Development/sapphire/SapphireFrappliance/MetaDataImporting/SapphireAllImporter.m:66: warning: method definition for '-stillNeedsDisplayOfChooser:withContext:' not found
		/Users/mscifo/Development/sapphire/SapphireFrappliance/MetaDataImporting/SapphireAllImporter.m:66: warning: class 'SapphireAllImporter' does not fully implement the 'SapphireImporter' protocol
	    cd /Users/mscifo/Development/sapphire/SapphireFrappliance
    /Developer/usr/bin/gcc-4.0 -x objective-c -arch i386 -fmessage-length=0 -pipe -Wno-trigraphs -fpascal-strings -fasm-blocks -O3 -Wreturn-type -Wunused-variable -isysroot /Developer/SDKs/MacOSX10.4u.sdk -mmacosx-version-min=10.4 -gdwarf-2 -I/Users/mscifo/Development/sapphire/SapphireFrappliance/../build/Sapphire.build/Release/Sapphire.build/Sapphire.hmap -F/Users/mscifo/Development/sapphire/SapphireFrappliance/../build/Release -F/Developer/SDKs/MacOSX10.4u.sdk/System/Library/PrivateFrameworks -F/Developer/SDKs/MacOSX10.4u.sdk/System/Library/PrivateFrameworks -I/Users/mscifo/Development/sapphire/SapphireFrappliance/../build/Release/include -I/Users/mscifo/Development/sapphire/SapphireFrappliance/../build/Sapphire.build/Release/Sapphire.build/DerivedSources/i386 -I/Users/mscifo/Development/sapphire/SapphireFrappliance/../build/Sapphire.build/Release/Sapphire.build/DerivedSources -include /var/folders/VY/VYbADtKZGRa4OHBFErjaDU+++TI/-Caches-/com.apple.Xcode.501/SharedPrecompiledHeaders/Sapphire_Prefix-bscdmphjxtuegeatjkbrhiwtgpcz/Sapphire_Prefix.pch -c /Users/mscifo/Development/sapphire/SapphireFrappliance/MetaDataImporting/SapphireMovieImporter.m -o /Users/mscifo/Development/sapphire/SapphireFrappliance/../build/Sapphire.build/Release/Sapphire.build/Objects-normal/i386/SapphireMovieImporter.o
/Users/mscifo/Development/sapphire/SapphireFrappliance/MetaDataImporting/SapphireMovieImporter.m: In function '-[SapphireMovieImporter init]':
/Users/mscifo/Development/sapphire/SapphireFrappliance/MetaDataImporting/SapphireMovieImporter.m:81: warning: unused variable 'error'
/Users/mscifo/Development/sapphire/SapphireFrappliance/MetaDataImporting/SapphireMovieImporter.m: In function '-[SapphireMovieImporter retrievedSearchResuls:forObject:]':
/Users/mscifo/Development/sapphire/SapphireFrappliance/MetaDataImporting/SapphireMovieImporter.m:105: warning: conflicting types for '-(void)retrievedSearchResuls:(NSXMLDocument *)results forObject:(SapphireMovieImportStateData *)state'
/Users/mscifo/Development/sapphire/SapphireFrappliance/MetaDataImporting/SapphireSiteScraper.h:24: warning: previous declaration of '-(void)retrievedSearchResuls:(NSXMLDocument *)results forObject:(id)object'
/Users/mscifo/Development/sapphire/SapphireFrappliance/MetaDataImporting/SapphireMovieImporter.m: In function '-[SapphireMovieImporter retrievedMovieDetails:forObject:]':
/Users/mscifo/Development/sapphire/SapphireFrappliance/MetaDataImporting/SapphireMovieImporter.m:190: warning: conflicting types for '-(void)retrievedMovieDetails:(NSXMLDocument *)details forObject:(SapphireMovieImportStateData *)state'
/Users/mscifo/Development/sapphire/SapphireFrappliance/MetaDataImporting/SapphireSiteScraper.h:29: warning: previous declaration of '-(void)retrievedMovieDetails:(NSXMLDocument *)details forObject:(id)object'
/Users/mscifo/Development/sapphire/SapphireFrappliance/MetaDataImporting/SapphireMovieImporter.m: In function '-[SapphireMovieImporter importMetaData:path:]':
/Users/mscifo/Development/sapphire/SapphireFrappliance/MetaDataImporting/SapphireMovieImporter.m:464: warning: unused variable 'junk'
/Users/mscifo/Development/sapphire/SapphireFrappliance/MetaDataImporting/SapphireMovieImporter.m:428: warning: unused variable 'movieDataLink'
/Users/mscifo/Development/sapphire/SapphireFrappliance/MetaDataImporting/SapphireMovieImporter.m: In function '-[SapphireMovieImporter stillNeedsDisplayOfChooser:withContext:]':
/Users/mscifo/Development/sapphire/SapphireFrappliance/MetaDataImporting/SapphireMovieImporter.m:518: warning: conflicting types for '-(BOOL)stillNeedsDisplayOfChooser:(BRLayerController <SapphireChooser> *)chooser withContext:(SapphireMovieImportStateData *)state'
/Users/mscifo/Development/sapphire/SapphireFrappliance/MetaDataImporting/SapphireImporterDataMenu.h:113: warning: previous declaration of '-(BOOL)stillNeedsDisplayOfChooser:(BRLayerController <SapphireChooser> *)chooser withContext:(id)context'
/Users/mscifo/Development/sapphire/SapphireFrappliance/MetaDataImporting/SapphireMovieImporter.m: In function '-[SapphireMovieImporter exhumedChooser:withContext:]':
/Users/mscifo/Development/sapphire/SapphireFrappliance/MetaDataImporting/SapphireMovieImporter.m:548: warning: conflicting types for '-(void)exhumedChooser:(BRLayerController <SapphireChooser> *)chooser withContext:(SapphireMovieImportStateData *)state'
/Users/mscifo/Development/sapphire/SapphireFrappliance/MetaDataImporting/SapphireImporterDataMenu.h:123: warning: previous declaration of '-(void)exhumedChooser:(BRLayerController <SapphireChooser> *)chooser withContext:(id)context'
		/Users/mscifo/Development/sapphire/SapphireFrappliance/MetaDataImporting/SapphireMovieImporter.m:81: warning: unused variable 'error'
		/Users/mscifo/Development/sapphire/SapphireFrappliance/MetaDataImporting/SapphireMovieImporter.m:105: warning: conflicting types for '-(void)retrievedSearchResuls:(NSXMLDocument *)results forObject:(SapphireMovieImportStateData *)state'
		/Users/mscifo/Development/sapphire/SapphireFrappliance/MetaDataImporting/SapphireSiteScraper.h:24: warning: previous declaration of '-(void)retrievedSearchResuls:(NSXMLDocument *)results forObject:(id)object'
		/Users/mscifo/Development/sapphire/SapphireFrappliance/MetaDataImporting/SapphireMovieImporter.m:190: warning: conflicting types for '-(void)retrievedMovieDetails:(NSXMLDocument *)details forObject:(SapphireMovieImportStateData *)state'
		/Users/mscifo/Development/sapphire/SapphireFrappliance/MetaDataImporting/SapphireSiteScraper.h:29: warning: previous declaration of '-(void)retrievedMovieDetails:(NSXMLDocument *)details forObject:(id)object'
		/Users/mscifo/Development/sapphire/SapphireFrappliance/MetaDataImporting/SapphireMovieImporter.m:464: warning: unused variable 'junk'
		/Users/mscifo/Development/sapphire/SapphireFrappliance/MetaDataImporting/SapphireMovieImporter.m:428: warning: unused variable 'movieDataLink'
		/Users/mscifo/Development/sapphire/SapphireFrappliance/MetaDataImporting/SapphireMovieImporter.m:518: warning: conflicting types for '-(BOOL)stillNeedsDisplayOfChooser:(BRLayerController <SapphireChooser> *)chooser withContext:(SapphireMovieImportStateData *)state'
		/Users/mscifo/Development/sapphire/SapphireFrappliance/MetaDataImporting/SapphireImporterDataMenu.h:113: warning: previous declaration of '-(BOOL)stillNeedsDisplayOfChooser:(BRLayerController <SapphireChooser> *)chooser withContext:(id)context'
		/Users/mscifo/Development/sapphire/SapphireFrappliance/MetaDataImporting/SapphireMovieImporter.m:548: warning: conflicting types for '-(void)exhumedChooser:(BRLayerController <SapphireChooser> *)chooser withContext:(SapphireMovieImportStateData *)state'
		/Users/mscifo/Development/sapphire/SapphireFrappliance/MetaDataImporting/SapphireImporterDataMenu.h:123: warning: previous declaration of '-(void)exhumedChooser:(BRLayerController <SapphireChooser> *)chooser withContext:(id)context'
	    cd /Users/mscifo/Development/sapphire/SapphireFrappliance
    /Developer/usr/bin/gcc-4.0 -x objective-c -arch i386 -fmessage-length=0 -pipe -Wno-trigraphs -fpascal-strings -fasm-blocks -O3 -Wreturn-type -Wunused-variable -isysroot /Developer/SDKs/MacOSX10.4u.sdk -mmacosx-version-min=10.4 -gdwarf-2 -I/Users/mscifo/Development/sapphire/SapphireFrappliance/../build/Sapphire.build/Release/Sapphire.build/Sapphire.hmap -F/Users/mscifo/Development/sapphire/SapphireFrappliance/../build/Release -F/Developer/SDKs/MacOSX10.4u.sdk/System/Library/PrivateFrameworks -F/Developer/SDKs/MacOSX10.4u.sdk/System/Library/PrivateFrameworks -I/Users/mscifo/Development/sapphire/SapphireFrappliance/../build/Release/include -I/Users/mscifo/Development/sapphire/SapphireFrappliance/../build/Sapphire.build/Release/Sapphire.build/DerivedSources/i386 -I/Users/mscifo/Development/sapphire/SapphireFrappliance/../build/Sapphire.build/Release/Sapphire.build/DerivedSources -include /var/folders/VY/VYbADtKZGRa4OHBFErjaDU+++TI/-Caches-/com.apple.Xcode.501/SharedPrecompiledHeaders/Sapphire_Prefix-bscdmphjxtuegeatjkbrhiwtgpcz/Sapphire_Prefix.pch -c /Users/mscifo/Development/sapphire/SapphireFrappliance/MetaDataImporting/SapphireAllFileDataImporter.m -o /Users/mscifo/Development/sapphire/SapphireFrappliance/../build/Sapphire.build/Release/Sapphire.build/Objects-normal/i386/SapphireAllFileDataImporter.o
/Users/mscifo/Development/sapphire/SapphireFrappliance/MetaDataImporting/SapphireAllFileDataImporter.m:86: warning: incomplete implementation of class 'SapphireAllFileDataImporter'
/Users/mscifo/Development/sapphire/SapphireFrappliance/MetaDataImporting/SapphireAllFileDataImporter.m:86: warning: method definition for '-stillNeedsDisplayOfChooser:withContext:' not found
/Users/mscifo/Development/sapphire/SapphireFrappliance/MetaDataImporting/SapphireAllFileDataImporter.m:86: warning: class 'SapphireAllFileDataImporter' does not fully implement the 'SapphireImporter' protocol
		/Users/mscifo/Development/sapphire/SapphireFrappliance/MetaDataImporting/SapphireAllFileDataImporter.m:86: warning: incomplete implementation of class 'SapphireAllFileDataImporter'
		/Users/mscifo/Development/sapphire/SapphireFrappliance/MetaDataImporting/SapphireAllFileDataImporter.m:86: warning: method definition for '-stillNeedsDisplayOfChooser:withContext:' not found
		/Users/mscifo/Development/sapphire/SapphireFrappliance/MetaDataImporting/SapphireAllFileDataImporter.m:86: warning: class 'SapphireAllFileDataImporter' does not fully implement the 'SapphireImporter' protocol
	    cd /Users/mscifo/Development/sapphire/SapphireFrappliance
    /Developer/usr/bin/gcc-4.0 -x objective-c -arch i386 -fmessage-length=0 -pipe -Wno-trigraphs -fpascal-strings -fasm-blocks -O3 -Wreturn-type -Wunused-variable -isysroot /Developer/SDKs/MacOSX10.4u.sdk -mmacosx-version-min=10.4 -gdwarf-2 -I/Users/mscifo/Development/sapphire/SapphireFrappliance/../build/Sapphire.build/Release/Sapphire.build/Sapphire.hmap -F/Users/mscifo/Development/sapphire/SapphireFrappliance/../build/Release -F/Developer/SDKs/MacOSX10.4u.sdk/System/Library/PrivateFrameworks -F/Developer/SDKs/MacOSX10.4u.sdk/System/Library/PrivateFrameworks -I/Users/mscifo/Development/sapphire/SapphireFrappliance/../build/Release/include -I/Users/mscifo/Development/sapphire/SapphireFrappliance/../build/Sapphire.build/Release/Sapphire.build/DerivedSources/i386 -I/Users/mscifo/Development/sapphire/SapphireFrappliance/../build/Sapphire.build/Release/Sapphire.build/DerivedSources -include /var/folders/VY/VYbADtKZGRa4OHBFErjaDU+++TI/-Caches-/com.apple.Xcode.501/SharedPrecompiledHeaders/Sapphire_Prefix-bscdmphjxtuegeatjkbrhiwtgpcz/Sapphire_Prefix.pch -c /Users/mscifo/Development/sapphire/SapphireFrappliance/Browser/SapphireTextEntryController.m -o /Users/mscifo/Development/sapphire/SapphireFrappliance/../build/Sapphire.build/Release/Sapphire.build/Objects-normal/i386/SapphireTextEntryController.o
/Users/mscifo/Development/sapphire/SapphireFrappliance/Browser/SapphireTextEntryController.m:99:2: warning: #warning These need to be tuned for 1.1, but since I do not have 1.1 here, I cannot test them.
		/Users/mscifo/Development/sapphire/SapphireFrappliance/Browser/SapphireTextEntryController.m:99:2: warning: #warning These need to be tuned for 1.1, but since I do not have 1.1 here, I cannot test them.
	    cd /Users/mscifo/Development/sapphire/SapphireFrappliance
    /Developer/usr/bin/gcc-4.0 -x objective-c -arch i386 -fmessage-length=0 -pipe -Wno-trigraphs -fpascal-strings -fasm-blocks -O3 -Wreturn-type -Wunused-variable -isysroot /Developer/SDKs/MacOSX10.4u.sdk -mmacosx-version-min=10.4 -gdwarf-2 -I/Users/mscifo/Development/sapphire/SapphireFrappliance/../build/Sapphire.build/Release/Sapphire.build/Sapphire.hmap -F/Users/mscifo/Development/sapphire/SapphireFrappliance/../build/Release -F/Developer/SDKs/MacOSX10.4u.sdk/System/Library/PrivateFrameworks -F/Developer/SDKs/MacOSX10.4u.sdk/System/Library/PrivateFrameworks -I/Users/mscifo/Development/sapphire/SapphireFrappliance/../build/Release/include -I/Users/mscifo/Development/sapphire/SapphireFrappliance/../build/Sapphire.build/Release/Sapphire.build/DerivedSources/i386 -I/Users/mscifo/Development/sapphire/SapphireFrappliance/../build/Sapphire.build/Release/Sapphire.build/DerivedSources -include /var/folders/VY/VYbADtKZGRa4OHBFErjaDU+++TI/-Caches-/com.apple.Xcode.501/SharedPrecompiledHeaders/Sapphire_Prefix-bscdmphjxtuegeatjkbrhiwtgpcz/Sapphire_Prefix.pch -c /Users/mscifo/Development/sapphire/SapphireFrappliance/FRAppliance/SapphireURLLoader.m -o /Users/mscifo/Development/sapphire/SapphireFrappliance/../build/Sapphire.build/Release/Sapphire.build/Objects-normal/i386/SapphireURLLoader.o
/Users/mscifo/Development/sapphire/SapphireFrappliance/FRAppliance/SapphireURLLoader.m: In function '-[SapphireURLLoaderWorker cancelForTarget:]':
/Users/mscifo/Development/sapphire/SapphireFrappliance/FRAppliance/SapphireURLLoader.m:134: error: 'for' loop initial declaration used outside C99 mode
		/Users/mscifo/Development/sapphire/SapphireFrappliance/FRAppliance/SapphireURLLoader.m:134: error: 'for' loop initial declaration used outside C99 mode
	    cd /Users/mscifo/Development/sapphire/SapphireFrappliance
    /Developer/usr/bin/gcc-4.0 -x objective-c -arch i386 -fmessage-length=0 -pipe -Wno-trigraphs -fpascal-strings -fasm-blocks -O3 -Wreturn-type -Wunused-variable -isysroot /Developer/SDKs/MacOSX10.4u.sdk -mmacosx-version-min=10.4 -gdwarf-2 -I/Users/mscifo/Development/sapphire/SapphireFrappliance/../build/Sapphire.build/Release/Sapphire.build/Sapphire.hmap -F/Users/mscifo/Development/sapphire/SapphireFrappliance/../build/Release -F/Developer/SDKs/MacOSX10.4u.sdk/System/Library/PrivateFrameworks -F/Developer/SDKs/MacOSX10.4u.sdk/System/Library/PrivateFrameworks -I/Users/mscifo/Development/sapphire/SapphireFrappliance/../build/Release/include -I/Users/mscifo/Development/sapphire/SapphireFrappliance/../build/Sapphire.build/Release/Sapphire.build/DerivedSources/i386 -I/Users/mscifo/Development/sapphire/SapphireFrappliance/../build/Sapphire.build/Release/Sapphire.build/DerivedSources -include /var/folders/VY/VYbADtKZGRa4OHBFErjaDU+++TI/-Caches-/com.apple.Xcode.501/SharedPrecompiledHeaders/Sapphire_Prefix-bscdmphjxtuegeatjkbrhiwtgpcz/Sapphire_Prefix.pch -c /Users/mscifo/Development/sapphire/SapphireFrappliance/MetaDataImporting/SapphireScraper.m -o /Users/mscifo/Development/sapphire/SapphireFrappliance/../build/Sapphire.build/Release/Sapphire.build/Objects-normal/i386/SapphireScraper.o
/Users/mscifo/Development/sapphire/SapphireFrappliance/MetaDataImporting/SapphireScraper.m: In function '-[SapphireScraper clearBuffers]':
/Users/mscifo/Development/sapphire/SapphireFrappliance/MetaDataImporting/SapphireScraper.m:230: error: 'for' loop initial declaration used outside C99 mode
/Users/mscifo/Development/sapphire/SapphireFrappliance/MetaDataImporting/SapphireScraper.m: In function '-[SapphireScraper clearStorchMatches]':
/Users/mscifo/Development/sapphire/SapphireFrappliance/MetaDataImporting/SapphireScraper.m:245: error: 'for' loop initial declaration used outside C99 mode
/Users/mscifo/Development/sapphire/SapphireFrappliance/MetaDataImporting/SapphireScraper.m: In function '-[SapphireScraper parseSettings]':
/Users/mscifo/Development/sapphire/SapphireFrappliance/MetaDataImporting/SapphireScraper.m:289: error: 'for' loop initial declaration used outside C99 mode
/Users/mscifo/Development/sapphire/SapphireFrappliance/MetaDataImporting/SapphireScraper.m: In function 'bufferBooleanAttributeWithDefault':
/Users/mscifo/Development/sapphire/SapphireFrappliance/MetaDataImporting/SapphireScraper.m:330: error: 'for' loop initial declaration used outside C99 mode
/Users/mscifo/Development/sapphire/SapphireFrappliance/MetaDataImporting/SapphireScraper.m:340: error: 'for' loop initial declaration used outside C99 mode
/Users/mscifo/Development/sapphire/SapphireFrappliance/MetaDataImporting/SapphireScraper.m: In function '-[SapphireScraper parseElement:]':
/Users/mscifo/Development/sapphire/SapphireFrappliance/MetaDataImporting/SapphireScraper.m:563: error: 'for' loop initial declaration used outside C99 mode
/Users/mscifo/Development/sapphire/SapphireFrappliance/MetaDataImporting/SapphireScraper.m: In function '-[SapphireScraper parseFunction:]':
/Users/mscifo/Development/sapphire/SapphireFrappliance/MetaDataImporting/SapphireScraper.m:599: error: 'for' loop initial declaration used outside C99 mode
		/Users/mscifo/Development/sapphire/SapphireFrappliance/MetaDataImporting/SapphireScraper.m:230: error: 'for' loop initial declaration used outside C99 mode
		/Users/mscifo/Development/sapphire/SapphireFrappliance/MetaDataImporting/SapphireScraper.m:245: error: 'for' loop initial declaration used outside C99 mode
		/Users/mscifo/Development/sapphire/SapphireFrappliance/MetaDataImporting/SapphireScraper.m:289: error: 'for' loop initial declaration used outside C99 mode
		/Users/mscifo/Development/sapphire/SapphireFrappliance/MetaDataImporting/SapphireScraper.m:330: error: 'for' loop initial declaration used outside C99 mode
		/Users/mscifo/Development/sapphire/SapphireFrappliance/MetaDataImporting/SapphireScraper.m:340: error: 'for' loop initial declaration used outside C99 mode
		/Users/mscifo/Development/sapphire/SapphireFrappliance/MetaDataImporting/SapphireScraper.m:563: error: 'for' loop initial declaration used outside C99 mode
		/Users/mscifo/Development/sapphire/SapphireFrappliance/MetaDataImporting/SapphireScraper.m:599: error: 'for' loop initial declaration used outside C99 mode
	    cd /Users/mscifo/Development/sapphire/SapphireFrappliance
    /Developer/usr/bin/gcc-4.0 -x objective-c -arch ppc -mcpu=G4 -fmessage-length=0 -pipe -Wno-trigraphs -fpascal-strings -O3 -Wreturn-type -Wunused-variable -isysroot /Developer/SDKs/MacOSX10.4u.sdk -mtune=G5 -mmacosx-version-min=10.4 -gdwarf-2 -I/Users/mscifo/Development/sapphire/SapphireFrappliance/../build/Sapphire.build/Release/Sapphire.build/Sapphire.hmap -F/Users/mscifo/Development/sapphire/SapphireFrappliance/../build/Release -F/Developer/SDKs/MacOSX10.4u.sdk/System/Library/PrivateFrameworks -F/Developer/SDKs/MacOSX10.4u.sdk/System/Library/PrivateFrameworks -I/Users/mscifo/Development/sapphire/SapphireFrappliance/../build/Release/include -I/Users/mscifo/Development/sapphire/SapphireFrappliance/../build/Sapphire.build/Release/Sapphire.build/DerivedSources/ppc7400 -I/Users/mscifo/Development/sapphire/SapphireFrappliance/../build/Sapphire.build/Release/Sapphire.build/DerivedSources -include /var/folders/VY/VYbADtKZGRa4OHBFErjaDU+++TI/-Caches-/com.apple.Xcode.501/SharedPrecompiledHeaders/Sapphire_Prefix-fvtlttpkmipsawckxrhagwoizroi/Sapphire_Prefix.pch -c /Users/mscifo/Development/sapphire/SapphireFrappliance/MetaDataImporting/SapphireTVShowImporter.m -o /Users/mscifo/Development/sapphire/SapphireFrappliance/../build/Sapphire.build/Release/Sapphire.build/Objects-normal/ppc7400/SapphireTVShowImporter.o
/Users/mscifo/Development/sapphire/SapphireFrappliance/MetaDataImporting/SapphireTVShowImporter.m: In function '-[SapphireTVShowImporter retrievedSearchResuls:forObject:]':
/Users/mscifo/Development/sapphire/SapphireFrappliance/MetaDataImporting/SapphireTVShowImporter.m:234: warning: conflicting types for '-(void)retrievedSearchResuls:(NSXMLDocument *)results forObject:(SapphireTVShowImportStateData *)state'
/Users/mscifo/Development/sapphire/SapphireFrappliance/MetaDataImporting/SapphireSiteScraper.h:24: warning: previous declaration of '-(void)retrievedSearchResuls:(NSXMLDocument *)results forObject:(id)object'
/Users/mscifo/Development/sapphire/SapphireFrappliance/MetaDataImporting/SapphireTVShowImporter.m: In function '-[SapphireTVShowImporter getTVShowResultsForState:]':
/Users/mscifo/Development/sapphire/SapphireFrappliance/MetaDataImporting/SapphireTVShowImporter.m:309: warning: unused variable 'isDir'
/Users/mscifo/Development/sapphire/SapphireFrappliance/MetaDataImporting/SapphireTVShowImporter.m: In function '-[SapphireTVShowImporter retrievedShowDetails:forObject:]':
/Users/mscifo/Development/sapphire/SapphireFrappliance/MetaDataImporting/SapphireTVShowImporter.m:328: warning: conflicting types for '-(void)retrievedShowDetails:(NSXMLDocument *)details forObject:(SapphireTVShowImportStateData *)state'
/Users/mscifo/Development/sapphire/SapphireFrappliance/MetaDataImporting/SapphireSiteScraper.h:33: warning: previous declaration of '-(void)retrievedShowDetails:(NSXMLDocument *)details forObject:(id)object'
/Users/mscifo/Development/sapphire/SapphireFrappliance/MetaDataImporting/SapphireTVShowImporter.m: In function '-[SapphireTVShowImporter retrievedEpisodeList:forObject:]':
/Users/mscifo/Development/sapphire/SapphireFrappliance/MetaDataImporting/SapphireTVShowImporter.m:411: warning: conflicting types for '-(void)retrievedEpisodeList:(NSXMLDocument *)episodeList forObject:(SapphireTVShowImportStateData *)state'
/Users/mscifo/Development/sapphire/SapphireFrappliance/MetaDataImporting/SapphireSiteScraper.h:34: warning: previous declaration of '-(void)retrievedEpisodeList:(NSXMLDocument *)episodeList forObject:(id)object'
/Users/mscifo/Development/sapphire/SapphireFrappliance/MetaDataImporting/SapphireTVShowImporter.m: In function '-[SapphireTVShowImporter retrievedEpisodeDetails:forObject:]':
/Users/mscifo/Development/sapphire/SapphireFrappliance/MetaDataImporting/SapphireTVShowImporter.m:438: warning: conflicting types for '-(void)retrievedEpisodeDetails:(NSXMLDocument *)details forObject:(SapphireSingleTVShowEpisodeImportStateData *)state'
/Users/mscifo/Development/sapphire/SapphireFrappliance/MetaDataImporting/SapphireSiteScraper.h:35: warning: previous declaration of '-(void)retrievedEpisodeDetails:(NSXMLDocument *)details forObject:(id)object'
/Users/mscifo/Development/sapphire/SapphireFrappliance/MetaDataImporting/SapphireTVShowImporter.m: In function '-[SapphireTVShowImporter completedEpisode:forState:atIndex:]':
/Users/mscifo/Development/sapphire/SapphireFrappliance/MetaDataImporting/SapphireTVShowImporter.m:515: error: 'for' loop initial declaration used outside C99 mode
/Users/mscifo/Development/sapphire/SapphireFrappliance/MetaDataImporting/SapphireTVShowImporter.m: In function '-[SapphireTVShowImporter stillNeedsDisplayOfChooser:withContext:]':
/Users/mscifo/Development/sapphire/SapphireFrappliance/MetaDataImporting/SapphireTVShowImporter.m:759: warning: conflicting types for '-(BOOL)stillNeedsDisplayOfChooser:(BRLayerController <SapphireChooser> *)chooser withContext:(SapphireTVShowImportStateData *)state'
/Users/mscifo/Development/sapphire/SapphireFrappliance/MetaDataImporting/SapphireImporterDataMenu.h:113: warning: previous declaration of '-(BOOL)stillNeedsDisplayOfChooser:(BRLayerController <SapphireChooser> *)chooser withContext:(id)context'
/Users/mscifo/Development/sapphire/SapphireFrappliance/MetaDataImporting/SapphireTVShowImporter.m: In function '-[SapphireTVShowImporter exhumedChooser:withContext:]':
/Users/mscifo/Development/sapphire/SapphireFrappliance/MetaDataImporting/SapphireTVShowImporter.m:772: warning: conflicting types for '-(void)exhumedChooser:(BRLayerController <SapphireChooser> *)aChooser withContext:(SapphireTVShowImportStateData *)state'
/Users/mscifo/Development/sapphire/SapphireFrappliance/MetaDataImporting/SapphireImporterDataMenu.h:123: warning: previous declaration of '-(void)exhumedChooser:(BRLayerController <SapphireChooser> *)chooser withContext:(id)context'
		/Users/mscifo/Development/sapphire/SapphireFrappliance/MetaDataImporting/SapphireTVShowImporter.m:234: warning: conflicting types for '-(void)retrievedSearchResuls:(NSXMLDocument *)results forObject:(SapphireTVShowImportStateData *)state'
		/Users/mscifo/Development/sapphire/SapphireFrappliance/MetaDataImporting/SapphireSiteScraper.h:24: warning: previous declaration of '-(void)retrievedSearchResuls:(NSXMLDocument *)results forObject:(id)object'
		/Users/mscifo/Development/sapphire/SapphireFrappliance/MetaDataImporting/SapphireTVShowImporter.m:309: warning: unused variable 'isDir'
		/Users/mscifo/Development/sapphire/SapphireFrappliance/MetaDataImporting/SapphireTVShowImporter.m:328: warning: conflicting types for '-(void)retrievedShowDetails:(NSXMLDocument *)details forObject:(SapphireTVShowImportStateData *)state'
		/Users/mscifo/Development/sapphire/SapphireFrappliance/MetaDataImporting/SapphireSiteScraper.h:33: warning: previous declaration of '-(void)retrievedShowDetails:(NSXMLDocument *)details forObject:(id)object'
		/Users/mscifo/Development/sapphire/SapphireFrappliance/MetaDataImporting/SapphireTVShowImporter.m:411: warning: conflicting types for '-(void)retrievedEpisodeList:(NSXMLDocument *)episodeList forObject:(SapphireTVShowImportStateData *)state'
		/Users/mscifo/Development/sapphire/SapphireFrappliance/MetaDataImporting/SapphireSiteScraper.h:34: warning: previous declaration of '-(void)retrievedEpisodeList:(NSXMLDocument *)episodeList forObject:(id)object'
		/Users/mscifo/Development/sapphire/SapphireFrappliance/MetaDataImporting/SapphireTVShowImporter.m:438: warning: conflicting types for '-(void)retrievedEpisodeDetails:(NSXMLDocument *)details forObject:(SapphireSingleTVShowEpisodeImportStateData *)state'
		/Users/mscifo/Development/sapphire/SapphireFrappliance/MetaDataImporting/SapphireSiteScraper.h:35: warning: previous declaration of '-(void)retrievedEpisodeDetails:(NSXMLDocument *)details forObject:(id)object'
		/Users/mscifo/Development/sapphire/SapphireFrappliance/MetaDataImporting/SapphireTVShowImporter.m:515: error: 'for' loop initial declaration used outside C99 mode
		/Users/mscifo/Development/sapphire/SapphireFrappliance/MetaDataImporting/SapphireTVShowImporter.m:759: warning: conflicting types for '-(BOOL)stillNeedsDisplayOfChooser:(BRLayerController <SapphireChooser> *)chooser withContext:(SapphireTVShowImportStateData *)state'
		/Users/mscifo/Development/sapphire/SapphireFrappliance/MetaDataImporting/SapphireImporterDataMenu.h:113: warning: previous declaration of '-(BOOL)stillNeedsDisplayOfChooser:(BRLayerController <SapphireChooser> *)chooser withContext:(id)context'
		/Users/mscifo/Development/sapphire/SapphireFrappliance/MetaDataImporting/SapphireTVShowImporter.m:772: warning: conflicting types for '-(void)exhumedChooser:(BRLayerController <SapphireChooser> *)aChooser withContext:(SapphireTVShowImportStateData *)state'
		/Users/mscifo/Development/sapphire/SapphireFrappliance/MetaDataImporting/SapphireImporterDataMenu.h:123: warning: previous declaration of '-(void)exhumedChooser:(BRLayerController <SapphireChooser> *)chooser withContext:(id)context'
	    cd /Users/mscifo/Development/sapphire/SapphireFrappliance
    /Developer/usr/bin/gcc-4.0 -x objective-c -arch ppc -mcpu=G4 -fmessage-length=0 -pipe -Wno-trigraphs -fpascal-strings -O3 -Wreturn-type -Wunused-variable -isysroot /Developer/SDKs/MacOSX10.4u.sdk -mtune=G5 -mmacosx-version-min=10.4 -gdwarf-2 -I/Users/mscifo/Development/sapphire/SapphireFrappliance/../build/Sapphire.build/Release/Sapphire.build/Sapphire.hmap -F/Users/mscifo/Development/sapphire/SapphireFrappliance/../build/Release -F/Developer/SDKs/MacOSX10.4u.sdk/System/Library/PrivateFrameworks -F/Developer/SDKs/MacOSX10.4u.sdk/System/Library/PrivateFrameworks -I/Users/mscifo/Development/sapphire/SapphireFrappliance/../build/Release/include -I/Users/mscifo/Development/sapphire/SapphireFrappliance/../build/Sapphire.build/Release/Sapphire.build/DerivedSources/ppc7400 -I/Users/mscifo/Development/sapphire/SapphireFrappliance/../build/Sapphire.build/Release/Sapphire.build/DerivedSources -include /var/folders/VY/VYbADtKZGRa4OHBFErjaDU+++TI/-Caches-/com.apple.Xcode.501/SharedPrecompiledHeaders/Sapphire_Prefix-fvtlttpkmipsawckxrhagwoizroi/Sapphire_Prefix.pch -c /Users/mscifo/Development/sapphire/SapphireFrappliance/MetaDataImporting/SapphireAllImporter.m -o /Users/mscifo/Development/sapphire/SapphireFrappliance/../build/Sapphire.build/Release/Sapphire.build/Objects-normal/ppc7400/SapphireAllImporter.o
/Users/mscifo/Development/sapphire/SapphireFrappliance/MetaDataImporting/SapphireAllImporter.m:66: warning: incomplete implementation of class 'SapphireAllImporter'
/Users/mscifo/Development/sapphire/SapphireFrappliance/MetaDataImporting/SapphireAllImporter.m:66: warning: method definition for '-stillNeedsDisplayOfChooser:withContext:' not found
/Users/mscifo/Development/sapphire/SapphireFrappliance/MetaDataImporting/SapphireAllImporter.m:66: warning: class 'SapphireAllImporter' does not fully implement the 'SapphireImporter' protocol
		/Users/mscifo/Development/sapphire/SapphireFrappliance/MetaDataImporting/SapphireAllImporter.m:66: warning: incomplete implementation of class 'SapphireAllImporter'
		/Users/mscifo/Development/sapphire/SapphireFrappliance/MetaDataImporting/SapphireAllImporter.m:66: warning: method definition for '-stillNeedsDisplayOfChooser:withContext:' not found
		/Users/mscifo/Development/sapphire/SapphireFrappliance/MetaDataImporting/SapphireAllImporter.m:66: warning: class 'SapphireAllImporter' does not fully implement the 'SapphireImporter' protocol
	    cd /Users/mscifo/Development/sapphire/SapphireFrappliance
    /Developer/usr/bin/gcc-4.0 -x objective-c -arch ppc -mcpu=G4 -fmessage-length=0 -pipe -Wno-trigraphs -fpascal-strings -O3 -Wreturn-type -Wunused-variable -isysroot /Developer/SDKs/MacOSX10.4u.sdk -mtune=G5 -mmacosx-version-min=10.4 -gdwarf-2 -I/Users/mscifo/Development/sapphire/SapphireFrappliance/../build/Sapphire.build/Release/Sapphire.build/Sapphire.hmap -F/Users/mscifo/Development/sapphire/SapphireFrappliance/../build/Release -F/Developer/SDKs/MacOSX10.4u.sdk/System/Library/PrivateFrameworks -F/Developer/SDKs/MacOSX10.4u.sdk/System/Library/PrivateFrameworks -I/Users/mscifo/Development/sapphire/SapphireFrappliance/../build/Release/include -I/Users/mscifo/Development/sapphire/SapphireFrappliance/../build/Sapphire.build/Release/Sapphire.build/DerivedSources/ppc7400 -I/Users/mscifo/Development/sapphire/SapphireFrappliance/../build/Sapphire.build/Release/Sapphire.build/DerivedSources -include /var/folders/VY/VYbADtKZGRa4OHBFErjaDU+++TI/-Caches-/com.apple.Xcode.501/SharedPrecompiledHeaders/Sapphire_Prefix-fvtlttpkmipsawckxrhagwoizroi/Sapphire_Prefix.pch -c /Users/mscifo/Development/sapphire/SapphireFrappliance/MetaDataImporting/SapphireMovieImporter.m -o /Users/mscifo/Development/sapphire/SapphireFrappliance/../build/Sapphire.build/Release/Sapphire.build/Objects-normal/ppc7400/SapphireMovieImporter.o
/Users/mscifo/Development/sapphire/SapphireFrappliance/MetaDataImporting/SapphireMovieImporter.m: In function '-[SapphireMovieImporter init]':
/Users/mscifo/Development/sapphire/SapphireFrappliance/MetaDataImporting/SapphireMovieImporter.m:81: warning: unused variable 'error'
/Users/mscifo/Development/sapphire/SapphireFrappliance/MetaDataImporting/SapphireMovieImporter.m: In function '-[SapphireMovieImporter retrievedSearchResuls:forObject:]':
/Users/mscifo/Development/sapphire/SapphireFrappliance/MetaDataImporting/SapphireMovieImporter.m:105: warning: conflicting types for '-(void)retrievedSearchResuls:(NSXMLDocument *)results forObject:(SapphireMovieImportStateData *)state'
/Users/mscifo/Development/sapphire/SapphireFrappliance/MetaDataImporting/SapphireSiteScraper.h:24: warning: previous declaration of '-(void)retrievedSearchResuls:(NSXMLDocument *)results forObject:(id)object'
/Users/mscifo/Development/sapphire/SapphireFrappliance/MetaDataImporting/SapphireMovieImporter.m: In function '-[SapphireMovieImporter retrievedMovieDetails:forObject:]':
/Users/mscifo/Development/sapphire/SapphireFrappliance/MetaDataImporting/SapphireMovieImporter.m:190: warning: conflicting types for '-(void)retrievedMovieDetails:(NSXMLDocument *)details forObject:(SapphireMovieImportStateData *)state'
/Users/mscifo/Development/sapphire/SapphireFrappliance/MetaDataImporting/SapphireSiteScraper.h:29: warning: previous declaration of '-(void)retrievedMovieDetails:(NSXMLDocument *)details forObject:(id)object'
/Users/mscifo/Development/sapphire/SapphireFrappliance/MetaDataImporting/SapphireMovieImporter.m: In function '-[SapphireMovieImporter importMetaData:path:]':
/Users/mscifo/Development/sapphire/SapphireFrappliance/MetaDataImporting/SapphireMovieImporter.m:464: warning: unused variable 'junk'
/Users/mscifo/Development/sapphire/SapphireFrappliance/MetaDataImporting/SapphireMovieImporter.m:428: warning: unused variable 'movieDataLink'
/Users/mscifo/Development/sapphire/SapphireFrappliance/MetaDataImporting/SapphireMovieImporter.m: In function '-[SapphireMovieImporter stillNeedsDisplayOfChooser:withContext:]':
/Users/mscifo/Development/sapphire/SapphireFrappliance/MetaDataImporting/SapphireMovieImporter.m:518: warning: conflicting types for '-(BOOL)stillNeedsDisplayOfChooser:(BRLayerController <SapphireChooser> *)chooser withContext:(SapphireMovieImportStateData *)state'
/Users/mscifo/Development/sapphire/SapphireFrappliance/MetaDataImporting/SapphireImporterDataMenu.h:113: warning: previous declaration of '-(BOOL)stillNeedsDisplayOfChooser:(BRLayerController <SapphireChooser> *)chooser withContext:(id)context'
/Users/mscifo/Development/sapphire/SapphireFrappliance/MetaDataImporting/SapphireMovieImporter.m: In function '-[SapphireMovieImporter exhumedChooser:withContext:]':
/Users/mscifo/Development/sapphire/SapphireFrappliance/MetaDataImporting/SapphireMovieImporter.m:548: warning: conflicting types for '-(void)exhumedChooser:(BRLayerController <SapphireChooser> *)chooser withContext:(SapphireMovieImportStateData *)state'
/Users/mscifo/Development/sapphire/SapphireFrappliance/MetaDataImporting/SapphireImporterDataMenu.h:123: warning: previous declaration of '-(void)exhumedChooser:(BRLayerController <SapphireChooser> *)chooser withContext:(id)context'
		/Users/mscifo/Development/sapphire/SapphireFrappliance/MetaDataImporting/SapphireMovieImporter.m:81: warning: unused variable 'error'
		/Users/mscifo/Development/sapphire/SapphireFrappliance/MetaDataImporting/SapphireMovieImporter.m:105: warning: conflicting types for '-(void)retrievedSearchResuls:(NSXMLDocument *)results forObject:(SapphireMovieImportStateData *)state'
		/Users/mscifo/Development/sapphire/SapphireFrappliance/MetaDataImporting/SapphireSiteScraper.h:24: warning: previous declaration of '-(void)retrievedSearchResuls:(NSXMLDocument *)results forObject:(id)object'
		/Users/mscifo/Development/sapphire/SapphireFrappliance/MetaDataImporting/SapphireMovieImporter.m:190: warning: conflicting types for '-(void)retrievedMovieDetails:(NSXMLDocument *)details forObject:(SapphireMovieImportStateData *)state'
		/Users/mscifo/Development/sapphire/SapphireFrappliance/MetaDataImporting/SapphireSiteScraper.h:29: warning: previous declaration of '-(void)retrievedMovieDetails:(NSXMLDocument *)details forObject:(id)object'
		/Users/mscifo/Development/sapphire/SapphireFrappliance/MetaDataImporting/SapphireMovieImporter.m:464: warning: unused variable 'junk'
		/Users/mscifo/Development/sapphire/SapphireFrappliance/MetaDataImporting/SapphireMovieImporter.m:428: warning: unused variable 'movieDataLink'
		/Users/mscifo/Development/sapphire/SapphireFrappliance/MetaDataImporting/SapphireMovieImporter.m:518: warning: conflicting types for '-(BOOL)stillNeedsDisplayOfChooser:(BRLayerController <SapphireChooser> *)chooser withContext:(SapphireMovieImportStateData *)state'
		/Users/mscifo/Development/sapphire/SapphireFrappliance/MetaDataImporting/SapphireImporterDataMenu.h:113: warning: previous declaration of '-(BOOL)stillNeedsDisplayOfChooser:(BRLayerController <SapphireChooser> *)chooser withContext:(id)context'
		/Users/mscifo/Development/sapphire/SapphireFrappliance/MetaDataImporting/SapphireMovieImporter.m:548: warning: conflicting types for '-(void)exhumedChooser:(BRLayerController <SapphireChooser> *)chooser withContext:(SapphireMovieImportStateData *)state'
		/Users/mscifo/Development/sapphire/SapphireFrappliance/MetaDataImporting/SapphireImporterDataMenu.h:123: warning: previous declaration of '-(void)exhumedChooser:(BRLayerController <SapphireChooser> *)chooser withContext:(id)context'
	    cd /Users/mscifo/Development/sapphire/SapphireFrappliance
    /Developer/usr/bin/gcc-4.0 -x objective-c -arch ppc -mcpu=G4 -fmessage-length=0 -pipe -Wno-trigraphs -fpascal-strings -O3 -Wreturn-type -Wunused-variable -isysroot /Developer/SDKs/MacOSX10.4u.sdk -mtune=G5 -mmacosx-version-min=10.4 -gdwarf-2 -I/Users/mscifo/Development/sapphire/SapphireFrappliance/../build/Sapphire.build/Release/Sapphire.build/Sapphire.hmap -F/Users/mscifo/Development/sapphire/SapphireFrappliance/../build/Release -F/Developer/SDKs/MacOSX10.4u.sdk/System/Library/PrivateFrameworks -F/Developer/SDKs/MacOSX10.4u.sdk/System/Library/PrivateFrameworks -I/Users/mscifo/Development/sapphire/SapphireFrappliance/../build/Release/include -I/Users/mscifo/Development/sapphire/SapphireFrappliance/../build/Sapphire.build/Release/Sapphire.build/DerivedSources/ppc7400 -I/Users/mscifo/Development/sapphire/SapphireFrappliance/../build/Sapphire.build/Release/Sapphire.build/DerivedSources -include /var/folders/VY/VYbADtKZGRa4OHBFErjaDU+++TI/-Caches-/com.apple.Xcode.501/SharedPrecompiledHeaders/Sapphire_Prefix-fvtlttpkmipsawckxrhagwoizroi/Sapphire_Prefix.pch -c /Users/mscifo/Development/sapphire/SapphireFrappliance/MetaDataImporting/SapphireAllFileDataImporter.m -o /Users/mscifo/Development/sapphire/SapphireFrappliance/../build/Sapphire.build/Release/Sapphire.build/Objects-normal/ppc7400/SapphireAllFileDataImporter.o
/Users/mscifo/Development/sapphire/SapphireFrappliance/MetaDataImporting/SapphireAllFileDataImporter.m:86: warning: incomplete implementation of class 'SapphireAllFileDataImporter'
/Users/mscifo/Development/sapphire/SapphireFrappliance/MetaDataImporting/SapphireAllFileDataImporter.m:86: warning: method definition for '-stillNeedsDisplayOfChooser:withContext:' not found
/Users/mscifo/Development/sapphire/SapphireFrappliance/MetaDataImporting/SapphireAllFileDataImporter.m:86: warning: class 'SapphireAllFileDataImporter' does not fully implement the 'SapphireImporter' protocol
		/Users/mscifo/Development/sapphire/SapphireFrappliance/MetaDataImporting/SapphireAllFileDataImporter.m:86: warning: incomplete implementation of class 'SapphireAllFileDataImporter'
		/Users/mscifo/Development/sapphire/SapphireFrappliance/MetaDataImporting/SapphireAllFileDataImporter.m:86: warning: method definition for '-stillNeedsDisplayOfChooser:withContext:' not found
		/Users/mscifo/Development/sapphire/SapphireFrappliance/MetaDataImporting/SapphireAllFileDataImporter.m:86: warning: class 'SapphireAllFileDataImporter' does not fully implement the 'SapphireImporter' protocol
	    cd /Users/mscifo/Development/sapphire/SapphireFrappliance
    /Developer/usr/bin/gcc-4.0 -x objective-c -arch ppc -mcpu=G4 -fmessage-length=0 -pipe -Wno-trigraphs -fpascal-strings -O3 -Wreturn-type -Wunused-variable -isysroot /Developer/SDKs/MacOSX10.4u.sdk -mtune=G5 -mmacosx-version-min=10.4 -gdwarf-2 -I/Users/mscifo/Development/sapphire/SapphireFrappliance/../build/Sapphire.build/Release/Sapphire.build/Sapphire.hmap -F/Users/mscifo/Development/sapphire/SapphireFrappliance/../build/Release -F/Developer/SDKs/MacOSX10.4u.sdk/System/Library/PrivateFrameworks -F/Developer/SDKs/MacOSX10.4u.sdk/System/Library/PrivateFrameworks -I/Users/mscifo/Development/sapphire/SapphireFrappliance/../build/Release/include -I/Users/mscifo/Development/sapphire/SapphireFrappliance/../build/Sapphire.build/Release/Sapphire.build/DerivedSources/ppc7400 -I/Users/mscifo/Development/sapphire/SapphireFrappliance/../build/Sapphire.build/Release/Sapphire.build/DerivedSources -include /var/folders/VY/VYbADtKZGRa4OHBFErjaDU+++TI/-Caches-/com.apple.Xcode.501/SharedPrecompiledHeaders/Sapphire_Prefix-fvtlttpkmipsawckxrhagwoizroi/Sapphire_Prefix.pch -c /Users/mscifo/Development/sapphire/SapphireFrappliance/Browser/SapphireTextEntryController.m -o /Users/mscifo/Development/sapphire/SapphireFrappliance/../build/Sapphire.build/Release/Sapphire.build/Objects-normal/ppc7400/SapphireTextEntryController.o
/Users/mscifo/Development/sapphire/SapphireFrappliance/Browser/SapphireTextEntryController.m:99:2: warning: #warning These need to be tuned for 1.1, but since I do not have 1.1 here, I cannot test them.
		/Users/mscifo/Development/sapphire/SapphireFrappliance/Browser/SapphireTextEntryController.m:99:2: warning: #warning These need to be tuned for 1.1, but since I do not have 1.1 here, I cannot test them.
	    cd /Users/mscifo/Development/sapphire/SapphireFrappliance
    /Developer/usr/bin/gcc-4.0 -x objective-c -arch ppc -mcpu=G4 -fmessage-length=0 -pipe -Wno-trigraphs -fpascal-strings -O3 -Wreturn-type -Wunused-variable -isysroot /Developer/SDKs/MacOSX10.4u.sdk -mtune=G5 -mmacosx-version-min=10.4 -gdwarf-2 -I/Users/mscifo/Development/sapphire/SapphireFrappliance/../build/Sapphire.build/Release/Sapphire.build/Sapphire.hmap -F/Users/mscifo/Development/sapphire/SapphireFrappliance/../build/Release -F/Developer/SDKs/MacOSX10.4u.sdk/System/Library/PrivateFrameworks -F/Developer/SDKs/MacOSX10.4u.sdk/System/Library/PrivateFrameworks -I/Users/mscifo/Development/sapphire/SapphireFrappliance/../build/Release/include -I/Users/mscifo/Development/sapphire/SapphireFrappliance/../build/Sapphire.build/Release/Sapphire.build/DerivedSources/ppc7400 -I/Users/mscifo/Development/sapphire/SapphireFrappliance/../build/Sapphire.build/Release/Sapphire.build/DerivedSources -include /var/folders/VY/VYbADtKZGRa4OHBFErjaDU+++TI/-Caches-/com.apple.Xcode.501/SharedPrecompiledHeaders/Sapphire_Prefix-fvtlttpkmipsawckxrhagwoizroi/Sapphire_Prefix.pch -c /Users/mscifo/Development/sapphire/SapphireFrappliance/FRAppliance/SapphireURLLoader.m -o /Users/mscifo/Development/sapphire/SapphireFrappliance/../build/Sapphire.build/Release/Sapphire.build/Objects-normal/ppc7400/SapphireURLLoader.o
/Users/mscifo/Development/sapphire/SapphireFrappliance/FRAppliance/SapphireURLLoader.m: In function '-[SapphireURLLoaderWorker cancelForTarget:]':
/Users/mscifo/Development/sapphire/SapphireFrappliance/FRAppliance/SapphireURLLoader.m:134: error: 'for' loop initial declaration used outside C99 mode
		/Users/mscifo/Development/sapphire/SapphireFrappliance/FRAppliance/SapphireURLLoader.m:134: error: 'for' loop initial declaration used outside C99 mode
	    cd /Users/mscifo/Development/sapphire/SapphireFrappliance
    /Developer/usr/bin/gcc-4.0 -x objective-c -arch ppc -mcpu=G4 -fmessage-length=0 -pipe -Wno-trigraphs -fpascal-strings -O3 -Wreturn-type -Wunused-variable -isysroot /Developer/SDKs/MacOSX10.4u.sdk -mtune=G5 -mmacosx-version-min=10.4 -gdwarf-2 -I/Users/mscifo/Development/sapphire/SapphireFrappliance/../build/Sapphire.build/Release/Sapphire.build/Sapphire.hmap -F/Users/mscifo/Development/sapphire/SapphireFrappliance/../build/Release -F/Developer/SDKs/MacOSX10.4u.sdk/System/Library/PrivateFrameworks -F/Developer/SDKs/MacOSX10.4u.sdk/System/Library/PrivateFrameworks -I/Users/mscifo/Development/sapphire/SapphireFrappliance/../build/Release/include -I/Users/mscifo/Development/sapphire/SapphireFrappliance/../build/Sapphire.build/Release/Sapphire.build/DerivedSources/ppc7400 -I/Users/mscifo/Development/sapphire/SapphireFrappliance/../build/Sapphire.build/Release/Sapphire.build/DerivedSources -include /var/folders/VY/VYbADtKZGRa4OHBFErjaDU+++TI/-Caches-/com.apple.Xcode.501/SharedPrecompiledHeaders/Sapphire_Prefix-fvtlttpkmipsawckxrhagwoizroi/Sapphire_Prefix.pch -c /Users/mscifo/Development/sapphire/SapphireFrappliance/MetaDataImporting/SapphireScraper.m -o /Users/mscifo/Development/sapphire/SapphireFrappliance/../build/Sapphire.build/Release/Sapphire.build/Objects-normal/ppc7400/SapphireScraper.o
/Users/mscifo/Development/sapphire/SapphireFrappliance/MetaDataImporting/SapphireScraper.m: In function '-[SapphireScraper clearBuffers]':
/Users/mscifo/Development/sapphire/SapphireFrappliance/MetaDataImporting/SapphireScraper.m:230: error: 'for' loop initial declaration used outside C99 mode
/Users/mscifo/Development/sapphire/SapphireFrappliance/MetaDataImporting/SapphireScraper.m: In function '-[SapphireScraper clearStorchMatches]':
/Users/mscifo/Development/sapphire/SapphireFrappliance/MetaDataImporting/SapphireScraper.m:245: error: 'for' loop initial declaration used outside C99 mode
/Users/mscifo/Development/sapphire/SapphireFrappliance/MetaDataImporting/SapphireScraper.m: In function '-[SapphireScraper parseSettings]':
/Users/mscifo/Development/sapphire/SapphireFrappliance/MetaDataImporting/SapphireScraper.m:289: error: 'for' loop initial declaration used outside C99 mode
/Users/mscifo/Development/sapphire/SapphireFrappliance/MetaDataImporting/SapphireScraper.m: In function 'bufferBooleanAttributeWithDefault':
/Users/mscifo/Development/sapphire/SapphireFrappliance/MetaDataImporting/SapphireScraper.m:330: error: 'for' loop initial declaration used outside C99 mode
/Users/mscifo/Development/sapphire/SapphireFrappliance/MetaDataImporting/SapphireScraper.m:340: error: 'for' loop initial declaration used outside C99 mode
/Users/mscifo/Development/sapphire/SapphireFrappliance/MetaDataImporting/SapphireScraper.m: In function '-[SapphireScraper parseElement:]':
/Users/mscifo/Development/sapphire/SapphireFrappliance/MetaDataImporting/SapphireScraper.m:563: error: 'for' loop initial declaration used outside C99 mode
/Users/mscifo/Development/sapphire/SapphireFrappliance/MetaDataImporting/SapphireScraper.m: In function '-[SapphireScraper parseFunction:]':
/Users/mscifo/Development/sapphire/SapphireFrappliance/MetaDataImporting/SapphireScraper.m:599: error: 'for' loop initial declaration used outside C99 mode
		/Users/mscifo/Development/sapphire/SapphireFrappliance/MetaDataImporting/SapphireScraper.m:230: error: 'for' loop initial declaration used outside C99 mode
		/Users/mscifo/Development/sapphire/SapphireFrappliance/MetaDataImporting/SapphireScraper.m:245: error: 'for' loop initial declaration used outside C99 mode
		/Users/mscifo/Development/sapphire/SapphireFrappliance/MetaDataImporting/SapphireScraper.m:289: error: 'for' loop initial declaration used outside C99 mode
		/Users/mscifo/Development/sapphire/SapphireFrappliance/MetaDataImporting/SapphireScraper.m:330: error: 'for' loop initial declaration used outside C99 mode
		/Users/mscifo/Development/sapphire/SapphireFrappliance/MetaDataImporting/SapphireScraper.m:340: error: 'for' loop initial declaration used outside C99 mode
		/Users/mscifo/Development/sapphire/SapphireFrappliance/MetaDataImporting/SapphireScraper.m:563: error: 'for' loop initial declaration used outside C99 mode
		/Users/mscifo/Development/sapphire/SapphireFrappliance/MetaDataImporting/SapphireScraper.m:599: error: 'for' loop initial declaration used outside C99 mode
Building target “LeopardOnly” of project “Sapphire” with configuration “Release” — (26 errors)
	    cd /Users/mscifo/Development/sapphire/SapphireFrappliance
    /Developer/usr/bin/gcc-4.0 -x objective-c -arch i386 -fmessage-length=0 -pipe -Wno-trigraphs -fpascal-strings -fasm-blocks -O3 -Wreturn-type -Wunused-variable -isysroot /Developer/SDKs/MacOSX10.4u.sdk -mmacosx-version-min=10.4 -gdwarf-2 -I/Users/mscifo/Development/sapphire/SapphireFrappliance/../build/Sapphire.build/Release/LeopardOnly.build/LeopardOnly.hmap -F/Users/mscifo/Development/sapphire/SapphireFrappliance/../build/Release -F/Developer/SDKs/MacOSX10.4u.sdk/System/Library/PrivateFrameworks -F/Developer/SDKs/MacOSX10.4u.sdk/System/Library/PrivateFrameworks -I/Users/mscifo/Development/sapphire/SapphireFrappliance/../build/Release/include -I/Users/mscifo/Development/sapphire/SapphireFrappliance/../build/Sapphire.build/Release/LeopardOnly.build/DerivedSources/i386 -I/Users/mscifo/Development/sapphire/SapphireFrappliance/../build/Sapphire.build/Release/LeopardOnly.build/DerivedSources -c /Users/mscifo/Development/sapphire/SapphireFrappliance/Leopard/SapphireLeopardOnly.m -o /Users/mscifo/Development/sapphire/SapphireFrappliance/../build/Sapphire.build/Release/LeopardOnly.build/Objects-normal/i386/SapphireLeopardOnly.o
In file included from /Users/mscifo/Development/sapphire/SapphireFrappliance/Leopard/SapphireLeopardOnly.m:22:
/Users/mscifo/Development/sapphire/SapphireFrappliance/Leopard/SapphireLeopardFileEvents.h:32: error: syntax error before 'FSEventStreamRef'
		In file included from /Users/mscifo/Development/sapphire/SapphireFrappliance/Leopard/SapphireLeopardOnly.m:22:
			/Users/mscifo/Development/sapphire/SapphireFrappliance/Leopard/SapphireLeopardFileEvents.h:32: error: syntax error before 'FSEventStreamRef'
	    cd /Users/mscifo/Development/sapphire/SapphireFrappliance
    /Developer/usr/bin/gcc-4.0 -x objective-c -arch i386 -fmessage-length=0 -pipe -Wno-trigraphs -fpascal-strings -fasm-blocks -O3 -Wreturn-type -Wunused-variable -isysroot /Developer/SDKs/MacOSX10.4u.sdk -mmacosx-version-min=10.4 -gdwarf-2 -I/Users/mscifo/Development/sapphire/SapphireFrappliance/../build/Sapphire.build/Release/LeopardOnly.build/LeopardOnly.hmap -F/Users/mscifo/Development/sapphire/SapphireFrappliance/../build/Release -F/Developer/SDKs/MacOSX10.4u.sdk/System/Library/PrivateFrameworks -F/Developer/SDKs/MacOSX10.4u.sdk/System/Library/PrivateFrameworks -I/Users/mscifo/Development/sapphire/SapphireFrappliance/../build/Release/include -I/Users/mscifo/Development/sapphire/SapphireFrappliance/../build/Sapphire.build/Release/LeopardOnly.build/DerivedSources/i386 -I/Users/mscifo/Development/sapphire/SapphireFrappliance/../build/Sapphire.build/Release/LeopardOnly.build/DerivedSources -c /Users/mscifo/Development/sapphire/SapphireFrappliance/Leopard/SapphireLeopardFileEvents.m -o /Users/mscifo/Development/sapphire/SapphireFrappliance/../build/Sapphire.build/Release/LeopardOnly.build/Objects-normal/i386/SapphireLeopardFileEvents.o
In file included from /Users/mscifo/Development/sapphire/SapphireFrappliance/Leopard/SapphireLeopardFileEvents.m:21:
/Users/mscifo/Development/sapphire/SapphireFrappliance/Leopard/SapphireLeopardFileEvents.h:32: error: syntax error before 'FSEventStreamRef'
/Users/mscifo/Development/sapphire/SapphireFrappliance/Leopard/SapphireLeopardFileEvents.m:31: error: syntax error before 'stream'
/Users/mscifo/Development/sapphire/SapphireFrappliance/Leopard/SapphireLeopardFileEvents.m: In function 'fileStreamCallback':
/Users/mscifo/Development/sapphire/SapphireFrappliance/Leopard/SapphireLeopardFileEvents.m:34: error: 'eventPaths' undeclared (first use in this function)
/Users/mscifo/Development/sapphire/SapphireFrappliance/Leopard/SapphireLeopardFileEvents.m:34: error: (Each undeclared identifier is reported only once
/Users/mscifo/Development/sapphire/SapphireFrappliance/Leopard/SapphireLeopardFileEvents.m:34: error: for each function it appears in.)
/Users/mscifo/Development/sapphire/SapphireFrappliance/Leopard/SapphireLeopardFileEvents.m:35: error: 'numEvents' undeclared (first use in this function)
/Users/mscifo/Development/sapphire/SapphireFrappliance/Leopard/SapphireLeopardFileEvents.m:37: error: 'context' undeclared (first use in this function)
/Users/mscifo/Development/sapphire/SapphireFrappliance/Leopard/SapphireLeopardFileEvents.m: In function '-[SapphireLeopardFileEvents initWithContext:]':
/Users/mscifo/Development/sapphire/SapphireFrappliance/Leopard/SapphireLeopardFileEvents.m:51: error: 'FSEventStreamContext' undeclared (first use in this function)
/Users/mscifo/Development/sapphire/SapphireFrappliance/Leopard/SapphireLeopardFileEvents.m:51: error: syntax error before 'fcontext'
/Users/mscifo/Development/sapphire/SapphireFrappliance/Leopard/SapphireLeopardFileEvents.m:52: error: 'fcontext' undeclared (first use in this function)
/Users/mscifo/Development/sapphire/SapphireFrappliance/Leopard/SapphireLeopardFileEvents.m:57: error: 'stream' undeclared (first use in this function)
/Users/mscifo/Development/sapphire/SapphireFrappliance/Leopard/SapphireLeopardFileEvents.m:57: error: 'kFSEventStreamEventIdSinceNow' undeclared (first use in this function)
/Users/mscifo/Development/sapphire/SapphireFrappliance/Leopard/SapphireLeopardFileEvents.m:57: error: 'kFSEventStreamCreateFlagUseCFTypes' undeclared (first use in this function)
/Users/mscifo/Development/sapphire/SapphireFrappliance/Leopard/SapphireLeopardFileEvents.m: In function '-[SapphireLeopardFileEvents dealloc]':
/Users/mscifo/Development/sapphire/SapphireFrappliance/Leopard/SapphireLeopardFileEvents.m:66: error: 'stream' undeclared (first use in this function)
		In file included from /Users/mscifo/Development/sapphire/SapphireFrappliance/Leopard/SapphireLeopardFileEvents.m:21:
			/Users/mscifo/Development/sapphire/SapphireFrappliance/Leopard/SapphireLeopardFileEvents.h:32: error: syntax error before 'FSEventStreamRef'
		/Users/mscifo/Development/sapphire/SapphireFrappliance/Leopard/SapphireLeopardFileEvents.m:31: error: syntax error before 'stream'
		/Users/mscifo/Development/sapphire/SapphireFrappliance/Leopard/SapphireLeopardFileEvents.m:34: error: 'eventPaths' undeclared (first use in this function)
		/Users/mscifo/Development/sapphire/SapphireFrappliance/Leopard/SapphireLeopardFileEvents.m:35: error: 'numEvents' undeclared (first use in this function)
		/Users/mscifo/Development/sapphire/SapphireFrappliance/Leopard/SapphireLeopardFileEvents.m:37: error: 'context' undeclared (first use in this function)
		/Users/mscifo/Development/sapphire/SapphireFrappliance/Leopard/SapphireLeopardFileEvents.m:51: error: 'FSEventStreamContext' undeclared (first use in this function)
		/Users/mscifo/Development/sapphire/SapphireFrappliance/Leopard/SapphireLeopardFileEvents.m:51: error: syntax error before 'fcontext'
		/Users/mscifo/Development/sapphire/SapphireFrappliance/Leopard/SapphireLeopardFileEvents.m:52: error: 'fcontext' undeclared (first use in this function)
		/Users/mscifo/Development/sapphire/SapphireFrappliance/Leopard/SapphireLeopardFileEvents.m:57: error: 'stream' undeclared (first use in this function)
		/Users/mscifo/Development/sapphire/SapphireFrappliance/Leopard/SapphireLeopardFileEvents.m:57: error: 'kFSEventStreamEventIdSinceNow' undeclared (first use in this function)
		/Users/mscifo/Development/sapphire/SapphireFrappliance/Leopard/SapphireLeopardFileEvents.m:57: error: 'kFSEventStreamCreateFlagUseCFTypes' undeclared (first use in this function)
		/Users/mscifo/Development/sapphire/SapphireFrappliance/Leopard/SapphireLeopardFileEvents.m:66: error: 'stream' undeclared (first use in this function)
	    cd /Users/mscifo/Development/sapphire/SapphireFrappliance
    /Developer/usr/bin/gcc-4.0 -x objective-c -arch ppc -mcpu=G4 -fmessage-length=0 -pipe -Wno-trigraphs -fpascal-strings -O3 -Wreturn-type -Wunused-variable -isysroot /Developer/SDKs/MacOSX10.4u.sdk -mtune=G5 -mmacosx-version-min=10.4 -gdwarf-2 -I/Users/mscifo/Development/sapphire/SapphireFrappliance/../build/Sapphire.build/Release/LeopardOnly.build/LeopardOnly.hmap -F/Users/mscifo/Development/sapphire/SapphireFrappliance/../build/Release -F/Developer/SDKs/MacOSX10.4u.sdk/System/Library/PrivateFrameworks -F/Developer/SDKs/MacOSX10.4u.sdk/System/Library/PrivateFrameworks -I/Users/mscifo/Development/sapphire/SapphireFrappliance/../build/Release/include -I/Users/mscifo/Development/sapphire/SapphireFrappliance/../build/Sapphire.build/Release/LeopardOnly.build/DerivedSources/ppc7400 -I/Users/mscifo/Development/sapphire/SapphireFrappliance/../build/Sapphire.build/Release/LeopardOnly.build/DerivedSources -c /Users/mscifo/Development/sapphire/SapphireFrappliance/Leopard/SapphireLeopardOnly.m -o /Users/mscifo/Development/sapphire/SapphireFrappliance/../build/Sapphire.build/Release/LeopardOnly.build/Objects-normal/ppc7400/SapphireLeopardOnly.o
In file included from /Users/mscifo/Development/sapphire/SapphireFrappliance/Leopard/SapphireLeopardOnly.m:22:
/Users/mscifo/Development/sapphire/SapphireFrappliance/Leopard/SapphireLeopardFileEvents.h:32: error: syntax error before 'FSEventStreamRef'
		In file included from /Users/mscifo/Development/sapphire/SapphireFrappliance/Leopard/SapphireLeopardOnly.m:22:
			/Users/mscifo/Development/sapphire/SapphireFrappliance/Leopard/SapphireLeopardFileEvents.h:32: error: syntax error before 'FSEventStreamRef'
	    cd /Users/mscifo/Development/sapphire/SapphireFrappliance
    /Developer/usr/bin/gcc-4.0 -x objective-c -arch ppc -mcpu=G4 -fmessage-length=0 -pipe -Wno-trigraphs -fpascal-strings -O3 -Wreturn-type -Wunused-variable -isysroot /Developer/SDKs/MacOSX10.4u.sdk -mtune=G5 -mmacosx-version-min=10.4 -gdwarf-2 -I/Users/mscifo/Development/sapphire/SapphireFrappliance/../build/Sapphire.build/Release/LeopardOnly.build/LeopardOnly.hmap -F/Users/mscifo/Development/sapphire/SapphireFrappliance/../build/Release -F/Developer/SDKs/MacOSX10.4u.sdk/System/Library/PrivateFrameworks -F/Developer/SDKs/MacOSX10.4u.sdk/System/Library/PrivateFrameworks -I/Users/mscifo/Development/sapphire/SapphireFrappliance/../build/Release/include -I/Users/mscifo/Development/sapphire/SapphireFrappliance/../build/Sapphire.build/Release/LeopardOnly.build/DerivedSources/ppc7400 -I/Users/mscifo/Development/sapphire/SapphireFrappliance/../build/Sapphire.build/Release/LeopardOnly.build/DerivedSources -c /Users/mscifo/Development/sapphire/SapphireFrappliance/Leopard/SapphireLeopardFileEvents.m -o /Users/mscifo/Development/sapphire/SapphireFrappliance/../build/Sapphire.build/Release/LeopardOnly.build/Objects-normal/ppc7400/SapphireLeopardFileEvents.o
In file included from /Users/mscifo/Development/sapphire/SapphireFrappliance/Leopard/SapphireLeopardFileEvents.m:21:
/Users/mscifo/Development/sapphire/SapphireFrappliance/Leopard/SapphireLeopardFileEvents.h:32: error: syntax error before 'FSEventStreamRef'
/Users/mscifo/Development/sapphire/SapphireFrappliance/Leopard/SapphireLeopardFileEvents.m:31: error: syntax error before 'stream'
/Users/mscifo/Development/sapphire/SapphireFrappliance/Leopard/SapphireLeopardFileEvents.m: In function 'fileStreamCallback':
/Users/mscifo/Development/sapphire/SapphireFrappliance/Leopard/SapphireLeopardFileEvents.m:34: error: 'eventPaths' undeclared (first use in this function)
/Users/mscifo/Development/sapphire/SapphireFrappliance/Leopard/SapphireLeopardFileEvents.m:34: error: (Each undeclared identifier is reported only once
/Users/mscifo/Development/sapphire/SapphireFrappliance/Leopard/SapphireLeopardFileEvents.m:34: error: for each function it appears in.)
/Users/mscifo/Development/sapphire/SapphireFrappliance/Leopard/SapphireLeopardFileEvents.m:35: error: 'numEvents' undeclared (first use in this function)
/Users/mscifo/Development/sapphire/SapphireFrappliance/Leopard/SapphireLeopardFileEvents.m:37: error: 'context' undeclared (first use in this function)
/Users/mscifo/Development/sapphire/SapphireFrappliance/Leopard/SapphireLeopardFileEvents.m: In function '-[SapphireLeopardFileEvents initWithContext:]':
/Users/mscifo/Development/sapphire/SapphireFrappliance/Leopard/SapphireLeopardFileEvents.m:51: error: 'FSEventStreamContext' undeclared (first use in this function)
/Users/mscifo/Development/sapphire/SapphireFrappliance/Leopard/SapphireLeopardFileEvents.m:51: error: syntax error before 'fcontext'
/Users/mscifo/Development/sapphire/SapphireFrappliance/Leopard/SapphireLeopardFileEvents.m:52: error: 'fcontext' undeclared (first use in this function)
/Users/mscifo/Development/sapphire/SapphireFrappliance/Leopard/SapphireLeopardFileEvents.m:57: error: 'stream' undeclared (first use in this function)
/Users/mscifo/Development/sapphire/SapphireFrappliance/Leopard/SapphireLeopardFileEvents.m:57: error: 'kFSEventStreamEventIdSinceNow' undeclared (first use in this function)
/Users/mscifo/Development/sapphire/SapphireFrappliance/Leopard/SapphireLeopardFileEvents.m:57: error: 'kFSEventStreamCreateFlagUseCFTypes' undeclared (first use in this function)
/Users/mscifo/Development/sapphire/SapphireFrappliance/Leopard/SapphireLeopardFileEvents.m: In function '-[SapphireLeopardFileEvents dealloc]':
/Users/mscifo/Development/sapphire/SapphireFrappliance/Leopard/SapphireLeopardFileEvents.m:66: error: 'stream' undeclared (first use in this function)
		In file included from /Users/mscifo/Development/sapphire/SapphireFrappliance/Leopard/SapphireLeopardFileEvents.m:21:
			/Users/mscifo/Development/sapphire/SapphireFrappliance/Leopard/SapphireLeopardFileEvents.h:32: error: syntax error before 'FSEventStreamRef'
		/Users/mscifo/Development/sapphire/SapphireFrappliance/Leopard/SapphireLeopardFileEvents.m:31: error: syntax error before 'stream'
		/Users/mscifo/Development/sapphire/SapphireFrappliance/Leopard/SapphireLeopardFileEvents.m:34: error: 'eventPaths' undeclared (first use in this function)
		/Users/mscifo/Development/sapphire/SapphireFrappliance/Leopard/SapphireLeopardFileEvents.m:35: error: 'numEvents' undeclared (first use in this function)
		/Users/mscifo/Development/sapphire/SapphireFrappliance/Leopard/SapphireLeopardFileEvents.m:37: error: 'context' undeclared (first use in this function)
		/Users/mscifo/Development/sapphire/SapphireFrappliance/Leopard/SapphireLeopardFileEvents.m:51: error: 'FSEventStreamContext' undeclared (first use in this function)
		/Users/mscifo/Development/sapphire/SapphireFrappliance/Leopard/SapphireLeopardFileEvents.m:51: error: syntax error before 'fcontext'
		/Users/mscifo/Development/sapphire/SapphireFrappliance/Leopard/SapphireLeopardFileEvents.m:52: error: 'fcontext' undeclared (first use in this function)
		/Users/mscifo/Development/sapphire/SapphireFrappliance/Leopard/SapphireLeopardFileEvents.m:57: error: 'stream' undeclared (first use in this function)
		/Users/mscifo/Development/sapphire/SapphireFrappliance/Leopard/SapphireLeopardFileEvents.m:57: error: 'kFSEventStreamEventIdSinceNow' undeclared (first use in this function)
		/Users/mscifo/Development/sapphire/SapphireFrappliance/Leopard/SapphireLeopardFileEvents.m:57: error: 'kFSEventStreamCreateFlagUseCFTypes' undeclared (first use in this function)
		/Users/mscifo/Development/sapphire/SapphireFrappliance/Leopard/SapphireLeopardFileEvents.m:66: error: 'stream' undeclared (first use in this function)
Build failed (74 errors, 64 warnings)
Note: See TracTickets for help on using tickets.